{"text_format":"1","workbook":"xlsx","n_sheets":25,"sheets":["Listbox","ตั้งค่า","ชั้นเรียน","ห้องเรียน","วิชาเรียน","กิจกรรม","ตารางเวลา","ครูผู้สอน","ลงทะเบียนวิชาเรียน","ข้อมูลตารางสอน","จัดตารางสอน","พิมพ์ตารางเรียน","พิมพ์ตารางเรียนแบบย่อส่วน","พิมพ์ตารางสอนครู","Teacher1","Teacher2","Teacher3","Teacher4","Teacher5","Teacher6","พิมพ์ตารางสอนแบบย่อส่วน","ข้อมูลการใช้สถานที่","สรุปผลจำนวนคาบสอน","สรุปผลวิชาของครูผู้สอน","รายวิชาที่ทำการสอน"],"not_rendered":{"charts":0,"images":30,"macros":1,"external_links":0,"defined_names":23,"comments":0,"pivot_tables":0},"unopened":[],"bounds":{"document_bytes":16777216,"sheet_cells":100000,"rows_first":2000,"rows_last":500,"rows_between":2000,"halvings":0,"cell_chars":16384,"cell_head_chars":4096},"cells_cut":0,"cells_raw":0,"read":"whole","date_system":"1900"}

{"sheet":"Listbox","index":0,"n_rows":85,"n_cols":5,"rows_kept":85,"cut":false,"hidden":true,"merged":[]}
["คำนำหน้า","นับเวลา","ประเภทวิชา","หน้า","วัน"]
["เด็กชาย","ชั่วโมง","พื้นฐาน",1,"ใช้"]
["เด็กหญิง","คาบ","เพิ่มเติม",{"$f":"D2+1","v":2},"ไม่ใช้"]
["นาย",null,"กิจกรรม",{"$f":"D3+1","v":3}]
["นางสาว",null,null,4]
["นาง",null,null,5]
[null,null,null,6]
[null,null,null,7]
[null,null,null,8]
[null,null,null,9]
[null,null,null,10]
[null,null,null,11]
[null,null,null,12]
[null,null,null,13]
[null,null,null,14]
[null,null,null,15]
[null,null,null,16]
[null,null,null,17]
[null,null,null,18]
[null,null,null,19]
[null,null,null,{"$f":"D20+1","v":20}]
[null,null,null,{"$f":"D21+1","v":21}]
[null,null,null,22]
[null,null,null,23]
[null,null,null,24]
[null,null,null,25]
[null,null,null,26]
[null,null,null,27]
[null,null,null,28]
[null,null,null,29]
[null,null,null,30]
[null,null,null,31]
[null,null,null,32]
[null,null,null,33]
[null,null,null,34]
[null,null,null,35]
[null,null,null,36]
[null,null,null,37]
[null,null,null,38]
[null,null,null,39]
[null,null,null,40]
[null,null,null,41]
[null,null,null,42]
[null,null,null,43]
[null,null,null,44]
[null,null,null,45]
[null,null,null,46]
[null,null,null,47]
[null,null,null,48]
[null,null,null,49]
[null,null,null,50]
[null,null,null,51]
[null,null,null,52]
[null,null,null,53]
[null,null,null,54]
[null,null,null,55]
[null,null,null,56]
[null,null,null,57]
[null,null,null,58]
[null,null,null,59]
[null,null,null,60]
[null,null,null,61]
[null,null,null,62]
[null,null,null,63]
[null,null,null,64]
[null,null,null,65]
[null,null,null,66]
[null,null,null,67]
[null,null,null,68]
[null,null,null,69]
[null,null,null,70]
[null,null,null,71]
[null,null,null,72]
[null,null,null,73]
[null,null,null,74]
[null,null,null,75]
[null,null,null,76]
[null,null,null,77]
[null,null,null,78]
[null,null,null,79]
[null,null,null,80]
[null,null,null,81]
[null,null,null,82]
[null,null,null,83]
[null,null,null,84]

{"sheet":"ตั้งค่า","index":1,"n_rows":21,"n_cols":8,"rows_kept":21,"cut":false,"hidden":false,"merged":[[7,0,7,4],[15,1,15,2]]}
[]
[]
[]
[]
[]
[]
[]
["ตั้งค่าโปรแกรม จัดตารางสอน ด้วย Microsoft Excel -Final-ไม่ใช้การติดต่อฐานข้อมูล",null,null,null,null,null,null,"s"]
[]
[null,"ปีการศึกษา ",2559]
[null,"ภาคเรียนที่ ",2]
[null,"โรงเรียน ","บ้านน้ำสอด"]
[null,"จังหวัด ","น่าน"]
[null,"สังกัด","สำนักงานเขตพื้นที่การศึกษาประถมศึกษาน่าน เขต 2"]
[null,"นับเวลาเป็น","ชั่วโมง"]
[null,"สำหรับการจัดข้อมูลตารางสอนใหม่"]
[null,"ขั้นตอนที่ 1 ลบข้อมูลการลงทะเบียนวิชาเรียนทั้งหมด","ขั้นตอนที่ 2 ลบข้อมูลตารางสอนทั้งหมด"]
[]
[]
[]
[null,"ขั้นตอนที่ 3 กรอกข้อมูล ชั้นเรียน,ห้องเรียน,วิชาเรียน,กิจกรรม ฯลฯ ให้ครบถ้วน","ขั้นตอนที่ 4. จัดตารางสอน ,พิมพ์ออกทางเครื่องพิมพ์"]

{"sheet":"ชั้นเรียน","index":2,"n_rows":13,"n_cols":6,"rows_kept":13,"cut":false,"hidden":false,"merged":[]}
["รหัสชั้น","ชื่อชั้น","ชื่อย่อ","ระดับชั้น",null,"รายชื่อระดับชั้น"]
["P101","ประถมศึกษาปีที่ 1/1","ป.1/1","ป.1",null,"ป.1"]
["P201","ประถมศึกษาปีที่ 2/1","ป.2/1","ป.2",null,"ป.2"]
["P301","ประถมศึกษาปีที่ 3/1","ป.3/1","ป.3",null,"ป.3"]
["P401","ประถมศึกษาปีที่ 4/1","ป.4/1","ป.4",null,"ป.4"]
["P501","ประถมศึกษาปีที่ 5/1","ป.5/1","ป.5",null,"ป.5"]
["P601","ประถมศึกษาปีที่ 6/1","ป.6/1","ป.6",null,"ป.6"]
[null,null,null,null,null,"ม.1"]
[null,null,null,null,null,"ม.2"]
[null,null,null,null,null,"ม.3"]
[null,null,null,null,null,"ม.4"]
[null,null,null,null,null,"ม.5"]
[null,null,null,null,null,"ม.6"]

{"sheet":"ห้องเรียน","index":3,"n_rows":25,"n_cols":3,"rows_kept":25,"cut":false,"hidden":false,"merged":[]}
["รหัสห้อง","ชื่อย่อ","ชื่อเต็ม"]
["ROOM1","ห้อง ป.1/1","ห้องประถมศึกษาปีที่ 1/1"]
["ROOM2","ห้อง ป.2/2","ห้องประถมศึกษาปีที่ 2/1"]
["ROOM3","ห้อง ป.3/1","ห้องประถมศึกษาปีที่ 3/1"]
["ROOM4","ห้อง ป.4/1","ห้องประถมศึกษาปีที่ 4/1"]
["ROOM5","ห้อง ป.5/1","ห้องประถมศึกษาปีที่ 5/1"]
["ROOM6","ห้อง ป.6/1","ห้องประถมศึกษาปีที่ 6/1"]
["ROOM7","ห้องคอมฯ","ห้องคอมพิวเตอร์"]
["ROOM8","ห้องวิทย์","ห้องวิทยาศาสตร์"]
["ROOM9","Soundlab","ห้องปฏิบัติการทางภาษา"]
["ROOM10","สนาม1","สนามโรงเรียนโซน 1"]
["ROOM11","สนาม2","สนามโรงเรียนโซน 2"]
["ROOM12","สนาม3","สนามโรงเรียนโซน 3"]
["ROOM13","สนาม4","สนามโรงเรียนโซน 4"]
["ROOM14","สนาม5","สนามโรงเรียนโซน 5"]
["ROOM15","สนาม6","สนามโรงเรียนโซน 6"]
["ROOM16","สนามโรงเรียน","สนามโรงเรียน"]
["ROOM17","สนามบาส","สนามบาสเก็ตบอล"]
["ROOM18","สนามวอลฯ","สนามวอลเลย์บอล"]
["ROOM19","สนามตะกร้อ","สนามตะกร้อ"]
["ROOM20","สนามเปตอง","สนามเปตอง"]
["ROOM21","หอประชุม","หอประชุม"]
["ROOM22","โรงยิมฯ","โรงยิมเนเซียม"]
["ROOM23","ห้องครัว","ห้องครัว"]
["ROOM24","โรงอาหาร","โรงอาหาร"]

{"sheet":"วิชาเรียน","index":4,"n_rows":110,"n_cols":6,"rows_kept":110,"cut":false,"hidden":false,"merged":[]}
["รหัสวิชา","ชื่อวิชา","ชื่อย่อ","ประเภท","จำนวนคาบ","ชั้น"]
["ท11101","ภาษาไทย 1","ไทย1","พื้นฐาน",5,"ป.1"]
["ค11101","คณิตศาสตร์ 1","คณิต1","พื้นฐาน",5,"ป.1"]
["ว11101","วิทยาศาสตร์ 1","วิทย์1","พื้นฐาน",2,"ป.1"]
["ส11101","สังคมศึกษา ศาสนาและวัฒนธรรม 1","สังคม1","พื้นฐาน",2,"ป.1"]
["ส11102","ประวัติศาสตร์ 1","ประวัติ1","พื้นฐาน",1,"ป.1"]
["พ11101-1","สุขศึกษา 1","สุขะ1","พื้นฐาน",1,"ป.1"]
["พ11101-2","พลศึกษา 1","พละ1","พื้นฐาน",1,"ป.1"]
["ศ11101-1","ศิลปะ 1","ศิลปะ1","พื้นฐาน",1,"ป.1"]
["ศ11101-2","ดนตรี 1","ดนตรี1","พื้นฐาน",1,"ป.1"]
["ง11101-1","การงานอาชีพและเทคโนโลยี  1","กอท1","พื้นฐาน",1,"ป.1"]
["อ11101","ภาษาอังกฤษ 1","อังกฤษ1","พื้นฐาน",1,"ป.1"]
["อ11201","ภาษาอังกฤษเพิ่มเติม ศัพท์แสนสนุก 1","ศัพท์แสนสนุก1","เพิ่มเติม",1,"ป.1"]
["ส11231","หน้าที่พลเมือง 1","พลเมือง1","เพิ่มเติม",1,"ป.1"]
["ก11901","แนะแนว 1","แนะแนว1","กิจกรรม",1,"ป.1"]
["ก11902","ลูกเสือ เนตรนารี 1","ลูกเสือ1","กิจกรรม",1,"ป.1"]
["ก11903","ชุมนุม","ชุมนุม1","กิจกรรม",1,"ป.1"]
["ก11905","ลดเวลาเรียนฯ(เรียนรู้ก้าวไกลกับ ICT)","ICT1","กิจกรรม",1,"ป.1"]
["ก11906","ลดเวลาเรียน เพิ่มเวลารู้","ลดเวลาเรียน","กิจกรรม",4,"ป.1"]
["ท12101","ภาษาไทย 2","ไทย2","พื้นฐาน",5,"ป.2"]
["ค12101","คณิตศาสตร์ 2","คณิต2","พื้นฐาน",5,"ป.2"]
["ว12101","วิทยาศาสตร์ 2","วิทย์2","พื้นฐาน",2,"ป.2"]
["ส12101","สังคมศึกษา ศาสนาและวัฒนธรรม 2","สังคม2","พื้นฐาน",2,"ป.2"]
["ส12102","ประวัติศาสตร์ 2","ประวัติ2","พื้นฐาน",1,"ป.2"]
["พ12101-1","สุขศึกษา 2","สุขะ2","พื้นฐาน",1,"ป.2"]
["พ12101-2","พลศึกษา 2","พละ2","พื้นฐาน",1,"ป.2"]
["ศ12101-1","ศิลปะ 2","ศิลปะ2","พื้นฐาน",1,"ป.2"]
["ศ12101-2","ดนตรี 2","ดนตรี2","พื้นฐาน",1,"ป.2"]
["ง12101-1","การงานอาชีพและเทคโนโลยี 2","กอท2","พื้นฐาน",1,"ป.2"]
["อ12101","ภาษาอังกฤษ 2","อังกฤษ2","พื้นฐาน",1,"ป.2"]
["อ12201","ภาษาอังกฤษเพิ่มเติม ศัพท์แสนสนุก 2","ศัพท์แสนสนุก2","เพิ่มเติม",1,"ป.2"]
["ส12232","หน้าที่พลเมือง 2","พลเมือง2","เพิ่มเติม",1,"ป.2"]
["ก12901","แนะแนว 2","แนะแนว2","กิจกรรม",1,"ป.2"]
["ก12902","ลูกเสือ เนตรนารี 2","ลูกเสือ2","กิจกรรม",1,"ป.2"]
["ก12903","ชุมนุม","ชุมนุม2","กิจกรรม",1,"ป.2"]
["ก12905","ลดเวลาเรียนฯ(เรียนรู้ก้าวไกลกับ ICT)","ICT2","กิจกรรม",1,"ป.2"]
["ก12906","ลดเวลาเรียน เพิ่มเวลารู้","ลดเวลาเรียน","กิจกรรม",4,"ป.2"]
["ท13101","ภาษาไทย 3","ไทย3","พื้นฐาน",5,"ป.3"]
["ค13101","คณิตศาสตร์ 3","คณิต3","พื้นฐาน",5,"ป.3"]
["ว13101","วิทยาศาสตร์ 3","วิทย์3","พื้นฐาน",2,"ป.3"]
["ส13101","สังคมศึกษา ศาสนาและวัฒนธรรม 3","สังคม3","พื้นฐาน",2,"ป.3"]
["ส13102","ประวัติศาสตร์ 3","ประวัติ3","พื้นฐาน",1,"ป.3"]
["พ13101-1","สุขศึกษา 3","สุขะ3","พื้นฐาน",1,"ป.3"]
["พ13101-2","พลศึกษา 3","พละ3","พื้นฐาน",1,"ป.3"]
["ศ13101-1","ศิลปะ 3","ศิลปะ3","พื้นฐาน",1,"ป.3"]
["ศ13101-2","ดนตรี 3","ดนตรี3","พื้นฐาน",1,"ป.3"]
["ง13101-1","การงานอาชีพและเทคโนโลยี 3","กอท3","พื้นฐาน",1,"ป.3"]
["อ13101","ภาษาอังกฤษ 3","อังกฤษ3","พื้นฐาน",1,"ป.3"]
["อ13201","ภาษาอังกฤษเพิ่มเติม ศัพท์แสนสนุก 3","ศัพท์แสนสนุก3","เพิ่มเติม",1,"ป.3"]
["ส13233","หน้าที่พลเมือง 3","พลเมือง3","เพิ่มเติม",1,"ป.3"]
["ก12901","แนะแนว 3","แนะแนว3","กิจกรรม",1,"ป.3"]
["ก12902","ลูกเสือ เนตรนารี 3","ลูกเสือ3","กิจกรรม",1,"ป.3"]
["ก12903","ชุมนุม","ชุมนุม3","กิจกรรม",1,"ป.3"]
["ก12905","ลดเวลาเรียนฯ(เรียนรู้ก้าวไกลกับ ICT)","ICT3","กิจกรรม",1,"ป.3"]
["ก12906","ลดเวลาเรียน เพิ่มเวลารู้","ลดเวลาเรียน","กิจกรรม",4,"ป.3"]
["ท14101","ภาษาไทย 4","ไทย4","พื้นฐาน",4,"ป.4"]
["ค14101","คณิตศาสตร์ 4","คณิต4","พื้นฐาน",4,"ป.4"]
["ว14101","วิทยาศาสตร์ 4","วิทย์4","พื้นฐาน",2,"ป.4"]
["ส14101","สังคมศึกษา ศาสนาและวัฒนธรรม 4","สังคม4","พื้นฐาน",2,"ป.4"]
["ส14102","ประวัติศาสตร์ 4","ประวัติ4","พื้นฐาน",1,"ป.4"]
["พ14101-1","สุขศึกษา 4","สุขะ4","พื้นฐาน",1,"ป.4"]
["พ14101-2","พลศึกษา 4","พละ4","พื้นฐาน",1,"ป.4"]
["ศ14101-1","ศิลปะ 4","ศิลปะ4","พื้นฐาน",1,"ป.4"]
["ศ14101-2","ดนตรี 4","ดนตรี4","พื้นฐาน",1,"ป.4"]
["ง14101-1","การงานอาชีพและเทคโนโลยี 4","กอท4","พื้นฐาน",1,"ป.4"]
["อ14101","ภาษาอังกฤษ 4","อังกฤษ4","พื้นฐาน",2,"ป.4"]
["อ14201","ภาษาอังกฤษเพิ่มเติม ศัพท์แสนสนุก 4","ศัพท์แสนสนุก4","เพิ่มเติม",1,"ป.4"]
["ส14234","หน้าที่พลเมือง 4","พลเมือง4","เพิ่มเติม",1,"ป.4"]
["ก14901","แนะแนว 4","แนะแนว4","กิจกรรม",1,"ป.4"]
["ก14902","ลูกเสือ เนตรนารี 3","ลูกเสือ4","กิจกรรม",1,"ป.4"]
["ก14903","ชุมนุม","ชุมนุม4","กิจกรรม",1,"ป.4"]
["ง14101-2","คอมพิวเตอร์ 4","คอมพิวเตอร์","กิจกรรม",1,"ป.4"]
["ก14906","ลดเวลาเรียน เพิ่มเวลารู้","ลดเวลาเรียน","กิจกรรม",5,"ป.4"]
["ท15101","ภาษาไทย 5","ไทย5","พื้นฐาน",4,"ป.5"]
["ค15101","คณิตศาสตร์ 5","คณิต5","พื้นฐาน",4,"ป.5"]
["ว15101","วิทยาศาสตร์ 5","วิทย์5","พื้นฐาน",2,"ป.5"]
["ส15101","สังคมศึกษา ศาสนาและวัฒนธรรม 5","สังคม5","พื้นฐาน",2,"ป.5"]
["ส15102","ประวัติศาสตร์ 5","ประวัติ5","พื้นฐาน",1,"ป.5"]
["พ15101-1","สุขศึกษา 5","สุขะ5","พื้นฐาน",1,"ป.5"]
["พ15101-2","พลศึกษา 5","พละ5","พื้นฐาน",1,"ป.5"]
["ศ15101-1","ศิลปะ 5","ศิลปะ5","พื้นฐาน",1,"ป.5"]
["ศ15101-2","ดนตรี 5","ดนตรี5","พื้นฐาน",1,"ป.5"]
["ง15101-1","การงานอาชีพและเทคโนโลยี 5","กอท5","พื้นฐาน",1,"ป.5"]
["อ15101","ภาษาอังกฤษ 5","อังกฤษ5","พื้นฐาน",2,"ป.5"]
["อ15201","ภาษาอังกฤษเพิ่มเติม ศัพท์แสนสนุก 5","ศัพท์แสนสนุก5","เพิ่มเติม",1,"ป.5"]
["ส15235","หน้าที่พลเมือง 5","พลเมือง5","เพิ่มเติม",1,"ป.5"]
["ก15901","แนะแนว 5","แนะแนว5","กิจกรรม",1,"ป.5"]
["ก15902","ลูกเสือ เนตรนารี 5","ลูกเสือ5","กิจกรรม",1,"ป.5"]
["ก15903","ชุมนุม","ชุมนุม5","กิจกรรม",1,"ป.5"]
["ง15101-2","คอมพิวเตอร์ 5","คอมพิวเตอร์","กิจกรรม",1,"ป.5"]
["ก15906-1","ลดเวลาเรียน เพิ่มเวลารู้","ลดเวลาเรียน","กิจกรรม",3,"ป.5"]
["ท16101","ภาษาไทย 6","ไทย6","พื้นฐาน",4,"ป.6"]
["ค16101","คณิตศาสตร์ 6","คณิต6","พื้นฐาน",4,"ป.6"]
["ว16101","วิทยาศาสตร์ 6","วิทย์6","พื้นฐาน",2,"ป.6"]
["ส16101","สังคมศึกษา ศาสนาและวัฒนธรรม 6","สังคม6","พื้นฐาน",2,"ป.6"]
["ส16102","ประวัติศาสตร์ 6","ประวัติ6","พื้นฐาน",1,"ป.6"]
["พ16101-1","สุขศึกษา 6","สุขะ6","พื้นฐาน",1,"ป.6"]
["พ16101-2","พลศึกษา 6","พละ6","พื้นฐาน",1,"ป.6"]
["ศ16101-1","ศิลปะ 6","ศิลปะ6","พื้นฐาน",1,"ป.6"]
["ศ16101-2","ดนตรี 6","ดนตรี6","พื้นฐาน",1,"ป.6"]
["ง16101-1","การงานอาชีพและเทคโนโลยี 6","กอท6","พื้นฐาน",1,"ป.6"]
["ง16101-2","คอมพิวเตอร์ 6","คอมพิวเตอร์","พื้นฐาน",1,"ป.6"]
["อ16101","ภาษาอังกฤษ 6","อังกฤษ6","พื้นฐาน",2,"ป.6"]
["อ16201","ภาษาอังกฤษเพิ่มเติม ศัพท์แสนสนุก 6","ศัพท์แสนสนุก6","เพิ่มเติม",1,"ป.6"]
["ส16236","หน้าที่พลเมือง 6","พลเมือง6","เพิ่มเติม",1,"ป.6"]
["ก16901","แนะแนว 6","แนะแนว6","กิจกรรม",1,"ป.6"]
["ก16902","ลูกเสือ เนตรนารี 6","ลูกเสือ6","กิจกรรม",1,"ป.6"]
["ก16903","ชุมนุม","ชุมนุม6","กิจกรรม",1,"ป.6"]
["ก16906","ลดเวลาเรียน เพิ่มเวลารู้","ลดเวลาเรียน","กิจกรรม",5,"ป.6"]
["ก15906-2","ลดเวลาเรียน เพิ่มเวลารู้","ลดเวลาเรียน","กิจกรรม",2,"ป.5"]

{"sheet":"กิจกรรม","index":5,"n_rows":5,"n_cols":3,"rows_kept":5,"cut":false,"hidden":false,"merged":[]}
["รหัสกิจกรรม","ชื่อกิจกรรม","ชื่อย่อ"]
["A001","กิจกรรมหน้าเสาธง","หน้าเสาธง"]
["A002","พัก","พัก"]
["A003","พักรับประทานอาหารกลางวัน","พักกลางวัน"]
["A004","อบรมคุณธรรม","อบรมคุณธรรม"]

{"sheet":"ตารางเวลา","index":6,"n_rows":13,"n_cols":3,"rows_kept":13,"cut":false,"hidden":false,"merged":[]}
["คาบที่/ชั่วโมงที่","เริ่ม","สิ้นสุด"]
[1,"8.00","8.30"]
[2,"8.31","9.30"]
[3,"9.31","10.30"]
[4,"10.31","11.30"]
[5,"11.31","12.30"]
[6,"12.31","13.30"]
[7,"13.31","14.30"]
[8,"14.31","15.30"]
[9]
[10]
[11]
[12]

{"sheet":"ครูผู้สอน","index":7,"n_rows":9,"n_cols":7,"rows_kept":9,"cut":false,"hidden":false,"merged":[]}
["รหัสครู","ชื่อย่อ","คำนำหน้า","ชื่อ","นามสกุล","สี","เลขรหัสสี"]
["T001","ครูนลินี","นางสาว","นลินี","สุวรรณโภค",null,16751052]
["T002","ครูปิยพล","นาย","ปิยพล","ยศศิริพันธุ์",null,12698111]
["T003","ครูชัยณรงค์","นาย","ชัยณรงค์","ธรรมสละ",null,5296274]
["T004","ครูเกียรติชัย","นาย","เกียรติชัย","วัดคำ",null,16764057]
["T005","ครูบุญธรรม","นาย","บุญธรรม","บุญลาภังค์",null,16737945]
["T006","ครูอุทัย","นาย","อุทัย","รัตนกันทา",null,15773696]
["T007","ครูรุ่งทิวา","นางสาว","รุ่งทิวา","คำสูง",null,16751103]
["T008","ครูภิญญาภรณ์","นางสาว","ภิญญาภรณ์","อินสองใจ",null,13431551]

{"sheet":"ลงทะเบียนวิชาเรียน","index":8,"n_rows":110,"n_cols":8,"rows_kept":110,"cut":false,"hidden":true,"merged":[]}
["TeacherID","TeacherName","ClassroomID","ClassroomName","SubjectID","SubjectName","RoomID","RoomName"]
["T001","ครูนลินี","P101","ประถมศึกษาปีที่ 1/1","ท11101","ภาษาไทย 1","ROOM1","ห้องประถมศึกษาปีที่ 1/1"]
["T001","ครูนลินี","P101","ประถมศึกษาปีที่ 1/1","ค11101","คณิตศาสตร์ 1","ROOM1","ห้องประถมศึกษาปีที่ 1/1"]
["T001","ครูนลินี","P101","ประถมศึกษาปีที่ 1/1","ส11101","สังคมศึกษา ศาสนาและวัฒนธรรม 1","ROOM1","ห้องประถมศึกษาปีที่ 1/1"]
["T001","ครูนลินี","P101","ประถมศึกษาปีที่ 1/1","ส11102","ประวัติศาสตร์ 1","ROOM1","ห้องประถมศึกษาปีที่ 1/1"]
["T001","ครูนลินี","P101","ประถมศึกษาปีที่ 1/1","พ11101-1","สุขศึกษา 1","ROOM1","ห้องประถมศึกษาปีที่ 1/1"]
["T001","ครูนลินี","P101","ประถมศึกษาปีที่ 1/1","พ11101-2","พลศึกษา 1","ROOM1","ห้องประถมศึกษาปีที่ 1/1"]
["T001","ครูนลินี","P101","ประถมศึกษาปีที่ 1/1","ศ11101-1","ศิลปะ 1","ROOM1","ห้องประถมศึกษาปีที่ 1/1"]
["T001","ครูนลินี","P101","ประถมศึกษาปีที่ 1/1","ศ11101-2","ดนตรี 1","ROOM1","ห้องประถมศึกษาปีที่ 1/1"]
["T001","ครูนลินี","P101","ประถมศึกษาปีที่ 1/1","ง11101-1","การงานอาชีพและเทคโนโลยี  1","ROOM1","ห้องประถมศึกษาปีที่ 1/1"]
["T001","ครูนลินี","P101","ประถมศึกษาปีที่ 1/1","ก11901","แนะแนว 1","ROOM1","ห้องประถมศึกษาปีที่ 1/1"]
["T001","ครูนลินี","P101","ประถมศึกษาปีที่ 1/1","ก11902","ลูกเสือ เนตรนารี 1","ROOM1","ห้องประถมศึกษาปีที่ 1/1"]
["T001","ครูนลินี","P101","ประถมศึกษาปีที่ 1/1","ก11903","ชุมนุม","ROOM1","ห้องประถมศึกษาปีที่ 1/1"]
["T001","ครูนลินี","P101","ประถมศึกษาปีที่ 1/1","ก11906","ลดเวลาเรียน เพิ่มเวลารู้","ROOM1","ห้องประถมศึกษาปีที่ 1/1"]
["T005","ครูบุญธรรม","P101","ประถมศึกษาปีที่ 1/1","ก11905","ลดเวลาเรียนฯ(เรียนรู้ก้าวไกลกับ ICT)","ROOM7","ห้องคอมพิวเตอร์"]
["T007","ครูรุ่งทิวา","P101","ประถมศึกษาปีที่ 1/1","อ11101","ภาษาอังกฤษ 1","ROOM9","ห้องปฏิบัติการทางภาษา"]
["T007","ครูรุ่งทิวา","P101","ประถมศึกษาปีที่ 1/1","อ11201","ภาษาอังกฤษเพิ่มเติม ศัพท์แสนสนุก 1","ROOM9","ห้องปฏิบัติการทางภาษา"]
["T008","ครูภิญญาภรณ์","P101","ประถมศึกษาปีที่ 1/1","ว11101","วิทยาศาสตร์ 1","ROOM8","ห้องวิทยาศาสตร์"]
["T002","ครูปิยพล","P201","ประถมศึกษาปีที่ 2/1","ท12101","ภาษาไทย 2","ROOM2","ห้องประถมศึกษาปีที่ 2/1"]
["T002","ครูปิยพล","P201","ประถมศึกษาปีที่ 2/1","ส12101","สังคมศึกษา ศาสนาและวัฒนธรรม 2","ROOM2","ห้องประถมศึกษาปีที่ 2/1"]
["T002","ครูปิยพล","P201","ประถมศึกษาปีที่ 2/1","ส12102","ประวัติศาสตร์ 2","ROOM2","ห้องประถมศึกษาปีที่ 2/1"]
["T002","ครูปิยพล","P201","ประถมศึกษาปีที่ 2/1","พ12101-1","สุขศึกษา 2","ROOM2","ห้องประถมศึกษาปีที่ 2/1"]
["T002","ครูปิยพล","P201","ประถมศึกษาปีที่ 2/1","พ12101-2","พลศึกษา 2","ROOM2","ห้องประถมศึกษาปีที่ 2/1"]
["T002","ครูปิยพล","P201","ประถมศึกษาปีที่ 2/1","ศ12101-1","ศิลปะ 2","ROOM2","ห้องประถมศึกษาปีที่ 2/1"]
["T002","ครูปิยพล","P201","ประถมศึกษาปีที่ 2/1","ศ12101-2","ดนตรี 2","ROOM2","ห้องประถมศึกษาปีที่ 2/1"]
["T002","ครูปิยพล","P201","ประถมศึกษาปีที่ 2/1","ง12101-1","การงานอาชีพและเทคโนโลยี 2","ROOM2","ห้องประถมศึกษาปีที่ 2/1"]
["T002","ครูปิยพล","P201","ประถมศึกษาปีที่ 2/1","ส12232","หน้าที่พลเมือง 2","ROOM2","ห้องประถมศึกษาปีที่ 2/1"]
["T002","ครูปิยพล","P201","ประถมศึกษาปีที่ 2/1","ก12901","แนะแนว 2","ROOM2","ห้องประถมศึกษาปีที่ 2/1"]
["T002","ครูปิยพล","P201","ประถมศึกษาปีที่ 2/1","ก12902","ลูกเสือ เนตรนารี 2","ROOM2","ห้องประถมศึกษาปีที่ 2/1"]
["T002","ครูปิยพล","P201","ประถมศึกษาปีที่ 2/1","ก12903","ชุมนุม","ROOM2","ห้องประถมศึกษาปีที่ 2/1"]
["T005","ครูบุญธรรม","P201","ประถมศึกษาปีที่ 2/1","ก12905","ลดเวลาเรียนฯ(เรียนรู้ก้าวไกลกับ ICT)","ROOM7","ห้องคอมพิวเตอร์"]
["T007","ครูรุ่งทิวา","P201","ประถมศึกษาปีที่ 2/1","อ12101","ภาษาอังกฤษ 2","ROOM9","ห้องปฏิบัติการทางภาษา"]
["T007","ครูรุ่งทิวา","P201","ประถมศึกษาปีที่ 2/1","อ12201","ภาษาอังกฤษเพิ่มเติม ศัพท์แสนสนุก 2","ROOM9","ห้องปฏิบัติการทางภาษา"]
["T008","ครูภิญญาภรณ์","P201","ประถมศึกษาปีที่ 2/1","ค12101","คณิตศาสตร์ 2","ROOM2","ห้องประถมศึกษาปีที่ 2/1"]
["T008","ครูภิญญาภรณ์","P201","ประถมศึกษาปีที่ 2/1","ว12101","วิทยาศาสตร์ 2","ROOM8","ห้องวิทยาศาสตร์"]
["T003","ครูชัยณรงค์","P301","ประถมศึกษาปีที่ 3/1","ท13101","ภาษาไทย 3","ROOM3","ห้องประถมศึกษาปีที่ 3/1"]
["T003","ครูชัยณรงค์","P301","ประถมศึกษาปีที่ 3/1","ค13101","คณิตศาสตร์ 3","ROOM3","ห้องประถมศึกษาปีที่ 3/1"]
["T003","ครูชัยณรงค์","P301","ประถมศึกษาปีที่ 3/1","ส13101","สังคมศึกษา ศาสนาและวัฒนธรรม 3","ROOM3","ห้องประถมศึกษาปีที่ 3/1"]
["T003","ครูชัยณรงค์","P301","ประถมศึกษาปีที่ 3/1","ส13102","ประวัติศาสตร์ 3","ROOM3","ห้องประถมศึกษาปีที่ 3/1"]
["T003","ครูชัยณรงค์","P301","ประถมศึกษาปีที่ 3/1","พ13101-1","สุขศึกษา 3","ROOM3","ห้องประถมศึกษาปีที่ 3/1"]
["T003","ครูชัยณรงค์","P301","ประถมศึกษาปีที่ 3/1","พ13101-2","พลศึกษา 3","ROOM3","ห้องประถมศึกษาปีที่ 3/1"]
["T003","ครูชัยณรงค์","P301","ประถมศึกษาปีที่ 3/1","ศ13101-1","ศิลปะ 3","ROOM3","ห้องประถมศึกษาปีที่ 3/1"]
["T003","ครูชัยณรงค์","P301","ประถมศึกษาปีที่ 3/1","ศ13101-2","ดนตรี 3","ROOM3","ห้องประถมศึกษาปีที่ 3/1"]
["T003","ครูชัยณรงค์","P301","ประถมศึกษาปีที่ 3/1","ง13101-1","การงานอาชีพและเทคโนโลยี 3","ROOM3","ห้องประถมศึกษาปีที่ 3/1"]
["T003","ครูชัยณรงค์","P301","ประถมศึกษาปีที่ 3/1","ส13233","หน้าที่พลเมือง 3","ROOM3","ห้องประถมศึกษาปีที่ 3/1"]
["T003","ครูชัยณรงค์","P301","ประถมศึกษาปีที่ 3/1","ก12901","แนะแนว 2","ROOM3","ห้องประถมศึกษาปีที่ 3/1"]
["T003","ครูชัยณรงค์","P301","ประถมศึกษาปีที่ 3/1","ก12902","ลูกเสือ เนตรนารี 2","ROOM3","ห้องประถมศึกษาปีที่ 3/1"]
["T003","ครูชัยณรงค์","P301","ประถมศึกษาปีที่ 3/1","ก12903","ชุมนุม","ROOM3","ห้องประถมศึกษาปีที่ 3/1"]
["T003","ครูชัยณรงค์","P301","ประถมศึกษาปีที่ 3/1","ก12906","ลดเวลาเรียน เพิ่มเวลารู้","ROOM3","ห้องประถมศึกษาปีที่ 3/1"]
["T005","ครูบุญธรรม","P301","ประถมศึกษาปีที่ 3/1","ก12905","ลดเวลาเรียนฯ(เรียนรู้ก้าวไกลกับ ICT)","ROOM7","ห้องคอมพิวเตอร์"]
["T007","ครูรุ่งทิวา","P301","ประถมศึกษาปีที่ 3/1","อ13101","ภาษาอังกฤษ 3","ROOM9","ห้องปฏิบัติการทางภาษา"]
["T007","ครูรุ่งทิวา","P301","ประถมศึกษาปีที่ 3/1","อ13201","ภาษาอังกฤษเพิ่มเติม ศัพท์แสนสนุก 3","ROOM9","ห้องปฏิบัติการทางภาษา"]
["T008","ครูภิญญาภรณ์","P301","ประถมศึกษาปีที่ 3/1","ว13101","วิทยาศาสตร์ 3","ROOM8","ห้องวิทยาศาสตร์"]
["T004","ครูเกียรติชัย","P401","ประถมศึกษาปีที่ 4/1","ท14101","ภาษาไทย 4","ROOM4","ห้องประถมศึกษาปีที่ 4/1"]
["T004","ครูเกียรติชัย","P401","ประถมศึกษาปีที่ 4/1","ค14101","คณิตศาสตร์ 4","ROOM4","ห้องประถมศึกษาปีที่ 4/1"]
["T004","ครูเกียรติชัย","P401","ประถมศึกษาปีที่ 4/1","ส14101","สังคมศึกษา ศาสนาและวัฒนธรรม 4","ROOM4","ห้องประถมศึกษาปีที่ 4/1"]
["T004","ครูเกียรติชัย","P401","ประถมศึกษาปีที่ 4/1","ส14102","ประวัติศาสตร์ 4","ROOM4","ห้องประถมศึกษาปีที่ 4/1"]
["T004","ครูเกียรติชัย","P401","ประถมศึกษาปีที่ 4/1","ศ14101-1","ศิลปะ 4","ROOM4","ห้องประถมศึกษาปีที่ 4/1"]
["T004","ครูเกียรติชัย","P401","ประถมศึกษาปีที่ 4/1","ศ14101-2","ดนตรี 4","ROOM4","ห้องประถมศึกษาปีที่ 4/1"]
["T004","ครูเกียรติชัย","P401","ประถมศึกษาปีที่ 4/1","ง14101-1","การงานอาชีพและเทคโนโลยี 4","ROOM4","ห้องประถมศึกษาปีที่ 4/1"]
["T004","ครูเกียรติชัย","P401","ประถมศึกษาปีที่ 4/1","ส14234","หน้าที่พลเมือง 4","ROOM4","ห้องประถมศึกษาปีที่ 4/1"]
["T004","ครูเกียรติชัย","P401","ประถมศึกษาปีที่ 4/1","ก14901","แนะแนว 4","ROOM4","ห้องประถมศึกษาปีที่ 4/1"]
["T004","ครูเกียรติชัย","P401","ประถมศึกษาปีที่ 4/1","ก14902","ลูกเสือ เนตรนารี 3","ROOM4","ห้องประถมศึกษาปีที่ 4/1"]
["T004","ครูเกียรติชัย","P401","ประถมศึกษาปีที่ 4/1","ก14903","ชุมนุม","ROOM4","ห้องประถมศึกษาปีที่ 4/1"]
["T004","ครูเกียรติชัย","P401","ประถมศึกษาปีที่ 4/1","ก14906","ลดเวลาเรียน เพิ่มเวลารู้","ROOM4","ห้องประถมศึกษาปีที่ 4/1"]
["T007","ครูรุ่งทิวา","P401","ประถมศึกษาปีที่ 4/1","อ14101","ภาษาอังกฤษ 4","ROOM9","ห้องปฏิบัติการทางภาษา"]
["T007","ครูรุ่งทิวา","P401","ประถมศึกษาปีที่ 4/1","อ14201","ภาษาอังกฤษเพิ่มเติม ศัพท์แสนสนุก 4","ROOM9","ห้องปฏิบัติการทางภาษา"]
["T008","ครูภิญญาภรณ์","P401","ประถมศึกษาปีที่ 4/1","ว14101","วิทยาศาสตร์ 4","ROOM8","ห้องวิทยาศาสตร์"]
["T005","ครูบุญธรรม","P401","ประถมศึกษาปีที่ 4/1","ง14101-2","คอมพิวเตอร์ 4","ROOM7","ห้องคอมพิวเตอร์"]
["T006","ครูอุทัย","P601","ประถมศึกษาปีที่ 6/1","ท16101","ภาษาไทย 6","ROOM6","ห้องประถมศึกษาปีที่ 6/1"]
["T006","ครูอุทัย","P601","ประถมศึกษาปีที่ 6/1","ค16101","คณิตศาสตร์ 6","ROOM6","ห้องประถมศึกษาปีที่ 6/1"]
["T006","ครูอุทัย","P601","ประถมศึกษาปีที่ 6/1","ส16101","สังคมศึกษา ศาสนาและวัฒนธรรม 6","ROOM6","ห้องประถมศึกษาปีที่ 6/1"]
["T006","ครูอุทัย","P601","ประถมศึกษาปีที่ 6/1","ส16102","ประวัติศาสตร์ 6","ROOM6","ห้องประถมศึกษาปีที่ 6/1"]
["T006","ครูอุทัย","P601","ประถมศึกษาปีที่ 6/1","พ16101-1","สุขศึกษา 6","ROOM6","ห้องประถมศึกษาปีที่ 6/1"]
["T006","ครูอุทัย","P601","ประถมศึกษาปีที่ 6/1","พ16101-2","พลศึกษา 6","ROOM6","ห้องประถมศึกษาปีที่ 6/1"]
["T006","ครูอุทัย","P601","ประถมศึกษาปีที่ 6/1","ส16236","หน้าที่พลเมือง 6","ROOM6","ห้องประถมศึกษาปีที่ 6/1"]
["T006","ครูอุทัย","P601","ประถมศึกษาปีที่ 6/1","ก16901","แนะแนว 6","ROOM6","ห้องประถมศึกษาปีที่ 6/1"]
["T006","ครูอุทัย","P601","ประถมศึกษาปีที่ 6/1","ก16902","ลูกเสือ เนตรนารี 6","ROOM6","ห้องประถมศึกษาปีที่ 6/1"]
["T006","ครูอุทัย","P601","ประถมศึกษาปีที่ 6/1","ก16903","ชุมนุม","ROOM6","ห้องประถมศึกษาปีที่ 6/1"]
["T006","ครูอุทัย","P601","ประถมศึกษาปีที่ 6/1","ก16906","ลดเวลาเรียน เพิ่มเวลารู้","ROOM6","ห้องประถมศึกษาปีที่ 6/1"]
["T007","ครูรุ่งทิวา","P601","ประถมศึกษาปีที่ 6/1","อ16101","ภาษาอังกฤษ 6","ROOM9","ห้องปฏิบัติการทางภาษา"]
["T007","ครูรุ่งทิวา","P601","ประถมศึกษาปีที่ 6/1","อ16201","ภาษาอังกฤษเพิ่มเติม ศัพท์แสนสนุก 6","ROOM9","ห้องปฏิบัติการทางภาษา"]
["T004","ครูเกียรติชัย","P601","ประถมศึกษาปีที่ 6/1","ศ16101-1","ศิลปะ 6","ROOM6","ห้องประถมศึกษาปีที่ 6/1"]
["T004","ครูเกียรติชัย","P601","ประถมศึกษาปีที่ 6/1","ศ16101-2","ดนตรี 6","ROOM6","ห้องประถมศึกษาปีที่ 6/1"]
["T005","ครูบุญธรรม","P601","ประถมศึกษาปีที่ 6/1","ง16101-1","การงานอาชีพและเทคโนโลยี 6","ROOM6","ห้องประถมศึกษาปีที่ 6/1"]
["T005","ครูบุญธรรม","P601","ประถมศึกษาปีที่ 6/1","ง16101-2","คอมพิวเตอร์ 6","ROOM7","ห้องคอมพิวเตอร์"]
["T008","ครูภิญญาภรณ์","P601","ประถมศึกษาปีที่ 6/1","ว16101","วิทยาศาสตร์ 6","ROOM8","ห้องวิทยาศาสตร์"]
["T005","ครูบุญธรรม","P501","ประถมศึกษาปีที่ 5/1","ท15101","ภาษาไทย 5","ROOM5","ห้องประถมศึกษาปีที่ 5/1"]
["T005","ครูบุญธรรม","P501","ประถมศึกษาปีที่ 5/1","ค15101","คณิตศาสตร์ 5","ROOM5","ห้องประถมศึกษาปีที่ 5/1"]
["T005","ครูบุญธรรม","P501","ประถมศึกษาปีที่ 5/1","ศ15101-1","ศิลปะ 5","ROOM5","ห้องประถมศึกษาปีที่ 5/1"]
["T005","ครูบุญธรรม","P501","ประถมศึกษาปีที่ 5/1","ศ15101-2","ดนตรี 5","ROOM5","ห้องประถมศึกษาปีที่ 5/1"]
["T005","ครูบุญธรรม","P501","ประถมศึกษาปีที่ 5/1","ง15101-1","การงานอาชีพและเทคโนโลยี 5","ROOM5","ห้องประถมศึกษาปีที่ 5/1"]
["T005","ครูบุญธรรม","P501","ประถมศึกษาปีที่ 5/1","ส15235","หน้าที่พลเมือง 5","ROOM5","ห้องประถมศึกษาปีที่ 5/1"]
["T005","ครูบุญธรรม","P501","ประถมศึกษาปีที่ 5/1","ก15901","แนะแนว 5","ROOM5","ห้องประถมศึกษาปีที่ 5/1"]
["T005","ครูบุญธรรม","P501","ประถมศึกษาปีที่ 5/1","ก15902","ลูกเสือ เนตรนารี 5","ROOM5","ห้องประถมศึกษาปีที่ 5/1"]
["T005","ครูบุญธรรม","P501","ประถมศึกษาปีที่ 5/1","ก15903","ชุมนุม","ROOM5","ห้องประถมศึกษาปีที่ 5/1"]
["T005","ครูบุญธรรม","P501","ประถมศึกษาปีที่ 5/1","ก15906-2","ลดเวลาเรียน เพิ่มเวลารู้","ROOM5","ห้องประถมศึกษาปีที่ 5/1"]
["T006","ครูอุทัย","P501","ประถมศึกษาปีที่ 5/1","พ15101-1","สุขศึกษา 5","ROOM5","ห้องประถมศึกษาปีที่ 5/1"]
["T006","ครูอุทัย","P501","ประถมศึกษาปีที่ 5/1","พ15101-2","พลศึกษา 5","ROOM5","ห้องประถมศึกษาปีที่ 5/1"]
["T008","ครูภิญญาภรณ์","P501","ประถมศึกษาปีที่ 5/1","ว15101","วิทยาศาสตร์ 5","ROOM8","ห้องวิทยาศาสตร์"]
["T007","ครูรุ่งทิวา","P501","ประถมศึกษาปีที่ 5/1","ส15101","สังคมศึกษา ศาสนาและวัฒนธรรม 5","ROOM5","ห้องประถมศึกษาปีที่ 5/1"]
["T007","ครูรุ่งทิวา","P501","ประถมศึกษาปีที่ 5/1","ส15102","ประวัติศาสตร์ 5","ROOM5","ห้องประถมศึกษาปีที่ 5/1"]
["T007","ครูรุ่งทิวา","P501","ประถมศึกษาปีที่ 5/1","อ15101","ภาษาอังกฤษ 5","ROOM9","ห้องปฏิบัติการทางภาษา"]
["T007","ครูรุ่งทิวา","P501","ประถมศึกษาปีที่ 5/1","อ15201","ภาษาอังกฤษเพิ่มเติม ศัพท์แสนสนุก 5","ROOM9","ห้องปฏิบัติการทางภาษา"]
["T007","ครูรุ่งทิวา","P501","ประถมศึกษาปีที่ 5/1","ก15906-1","ลดเวลาเรียน เพิ่มเวลารู้","ROOM5","ห้องประถมศึกษาปีที่ 5/1"]
["T008","ครูภิญญาภรณ์","P201","ประถมศึกษาปีที่ 2/1","ก12906","ลดเวลาเรียน เพิ่มเวลารู้","ROOM2","ห้องประถมศึกษาปีที่ 2/1"]
["T006","ครูอุทัย","P401","ประถมศึกษาปีที่ 4/1","พ14101-1","สุขศึกษา 4","ROOM4","ห้องประถมศึกษาปีที่ 4/1"]
["T006","ครูอุทัย","P401","ประถมศึกษาปีที่ 4/1","พ14101-2","พลศึกษา 4","ROOM4","ห้องประถมศึกษาปีที่ 4/1"]
["T001","ครูนลินี","P101","ประถมศึกษาปีที่ 1/1","ส11231","หน้าที่พลเมือง 1","ROOM1","ห้องประถมศึกษาปีที่ 1/1"]
["T005","ครูบุญธรรม","P501","ประถมศึกษาปีที่ 5/1","ง15101-2","คอมพิวเตอร์ 5","ROOM7","ห้องคอมพิวเตอร์"]

{"sheet":"ข้อมูลตารางสอน","index":9,"n_rows":241,"n_cols":13,"rows_kept":241,"cut":false,"hidden":true,"merged":[]}
["DayName","HourNo","SubActGroup","SubActName","TeacherID","ShotTeacher","TeacherColor","SubActID","ShotSubActName","ClassroomID","ShotClassName","RoomID","ShotRoomName"]
["อังคาร","1","กิจกรรม","กิจกรรมหน้าเสาธง",null,null,null,"A001","หน้าเสาธง","P101",null,"ROOM16","สนามโรงเรียน"]
["อังคาร","1","กิจกรรม","กิจกรรมหน้าเสาธง",null,null,null,"A001","หน้าเสาธง","P201",null,"ROOM16","สนามโรงเรียน"]
["อังคาร","1","กิจกรรม","กิจกรรมหน้าเสาธง",null,null,null,"A001","หน้าเสาธง","P401",null,"ROOM16","สนามโรงเรียน"]
["อังคาร","1","กิจกรรม","กิจกรรมหน้าเสาธง",null,null,null,"A001","หน้าเสาธง","P501",null,"ROOM16","สนามโรงเรียน"]
["อังคาร","1","กิจกรรม","กิจกรรมหน้าเสาธง",null,null,null,"A001","หน้าเสาธง","P601",null,"ROOM16","สนามโรงเรียน"]
["พุธ","1","กิจกรรม","กิจกรรมหน้าเสาธง",null,null,null,"A001","หน้าเสาธง","P101",null,"ROOM16","สนามโรงเรียน"]
["พุธ","1","กิจกรรม","กิจกรรมหน้าเสาธง",null,null,null,"A001","หน้าเสาธง","P201",null,"ROOM16","สนามโรงเรียน"]
["พุธ","1","กิจกรรม","กิจกรรมหน้าเสาธง",null,null,null,"A001","หน้าเสาธง","P401",null,"ROOM16","สนามโรงเรียน"]
["พุธ","1","กิจกรรม","กิจกรรมหน้าเสาธง",null,null,null,"A001","หน้าเสาธง","P501",null,"ROOM16","สนามโรงเรียน"]
["พุธ","1","กิจกรรม","กิจกรรมหน้าเสาธง",null,null,null,"A001","หน้าเสาธง","P601",null,"ROOM16","สนามโรงเรียน"]
["พฤหัสบดี","1","กิจกรรม","กิจกรรมหน้าเสาธง",null,null,null,"A001","หน้าเสาธง","P101",null,"ROOM16","สนามโรงเรียน"]
["พฤหัสบดี","1","กิจกรรม","กิจกรรมหน้าเสาธง",null,null,null,"A001","หน้าเสาธง","P201",null,"ROOM16","สนามโรงเรียน"]
["พฤหัสบดี","1","กิจกรรม","กิจกรรมหน้าเสาธง",null,null,null,"A001","หน้าเสาธง","P401",null,"ROOM16","สนามโรงเรียน"]
["พฤหัสบดี","1","กิจกรรม","กิจกรรมหน้าเสาธง",null,null,null,"A001","หน้าเสาธง","P501",null,"ROOM16","สนามโรงเรียน"]
["พฤหัสบดี","1","กิจกรรม","กิจกรรมหน้าเสาธง",null,null,null,"A001","หน้าเสาธง","P601",null,"ROOM16","สนามโรงเรียน"]
["ศุกร์","1","กิจกรรม","กิจกรรมหน้าเสาธง",null,null,null,"A001","หน้าเสาธง","P101",null,"ROOM16","สนามโรงเรียน"]
["ศุกร์","1","กิจกรรม","กิจกรรมหน้าเสาธง",null,null,null,"A001","หน้าเสาธง","P201",null,"ROOM16","สนามโรงเรียน"]
["ศุกร์","1","กิจกรรม","กิจกรรมหน้าเสาธง",null,null,null,"A001","หน้าเสาธง","P401",null,"ROOM16","สนามโรงเรียน"]
["ศุกร์","1","กิจกรรม","กิจกรรมหน้าเสาธง",null,null,null,"A001","หน้าเสาธง","P501",null,"ROOM16","สนามโรงเรียน"]
["ศุกร์","1","กิจกรรม","กิจกรรมหน้าเสาธง",null,null,null,"A001","หน้าเสาธง","P601",null,"ROOM16","สนามโรงเรียน"]
["จันทร์","5","กิจกรรม","พักรับประทานอาหารกลางวัน",null,null,null,"A003","พักกลางวัน","P101",null,"ROOM24","โรงอาหาร"]
["จันทร์","5","กิจกรรม","พักรับประทานอาหารกลางวัน",null,null,null,"A003","พักกลางวัน","P201",null,"ROOM24","โรงอาหาร"]
["จันทร์","5","กิจกรรม","พักรับประทานอาหารกลางวัน",null,null,null,"A003","พักกลางวัน","P401",null,"ROOM24","โรงอาหาร"]
["จันทร์","5","กิจกรรม","พักรับประทานอาหารกลางวัน",null,null,null,"A003","พักกลางวัน","P501",null,"ROOM24","โรงอาหาร"]
["จันทร์","5","กิจกรรม","พักรับประทานอาหารกลางวัน",null,null,null,"A003","พักกลางวัน","P601",null,"ROOM24","โรงอาหาร"]
["อังคาร","5","กิจกรรม","พักรับประทานอาหารกลางวัน",null,null,null,"A003","พักกลางวัน","P101",null,"ROOM24","โรงอาหาร"]
["อังคาร","5","กิจกรรม","พักรับประทานอาหารกลางวัน",null,null,null,"A003","พักกลางวัน","P201",null,"ROOM24","โรงอาหาร"]
["อังคาร","5","กิจกรรม","พักรับประทานอาหารกลางวัน",null,null,null,"A003","พักกลางวัน","P401",null,"ROOM24","โรงอาหาร"]
["อังคาร","5","กิจกรรม","พักรับประทานอาหารกลางวัน",null,null,null,"A003","พักกลางวัน","P501",null,"ROOM24","โรงอาหาร"]
["อังคาร","5","กิจกรรม","พักรับประทานอาหารกลางวัน",null,null,null,"A003","พักกลางวัน","P601",null,"ROOM24","โรงอาหาร"]
["พุธ","5","กิจกรรม","พักรับประทานอาหารกลางวัน",null,null,null,"A003","พักกลางวัน","P101",null,"ROOM24","โรงอาหาร"]
["พุธ","5","กิจกรรม","พักรับประทานอาหารกลางวัน",null,null,null,"A003","พักกลางวัน","P201",null,"ROOM24","โรงอาหาร"]
["พุธ","5","กิจกรรม","พักรับประทานอาหารกลางวัน",null,null,null,"A003","พักกลางวัน","P401",null,"ROOM24","โรงอาหาร"]
["พุธ","5","กิจกรรม","พักรับประทานอาหารกลางวัน",null,null,null,"A003","พักกลางวัน","P501",null,"ROOM24","โรงอาหาร"]
["พุธ","5","กิจกรรม","พักรับประทานอาหารกลางวัน",null,null,null,"A003","พักกลางวัน","P601",null,"ROOM24","โรงอาหาร"]
["พฤหัสบดี","5","กิจกรรม","พักรับประทานอาหารกลางวัน",null,null,null,"A003","พักกลางวัน","P101",null,"ROOM24","โรงอาหาร"]
["พฤหัสบดี","5","กิจกรรม","พักรับประทานอาหารกลางวัน",null,null,null,"A003","พักกลางวัน","P201",null,"ROOM24","โรงอาหาร"]
["พฤหัสบดี","5","กิจกรรม","พักรับประทานอาหารกลางวัน",null,null,null,"A003","พักกลางวัน","P401",null,"ROOM24","โรงอาหาร"]
["พฤหัสบดี","5","กิจกรรม","พักรับประทานอาหารกลางวัน",null,null,null,"A003","พักกลางวัน","P501",null,"ROOM24","โรงอาหาร"]
["พฤหัสบดี","5","กิจกรรม","พักรับประทานอาหารกลางวัน",null,null,null,"A003","พักกลางวัน","P601",null,"ROOM24","โรงอาหาร"]
["ศุกร์","5","กิจกรรม","พักรับประทานอาหารกลางวัน",null,null,null,"A003","พักกลางวัน","P101",null,"ROOM24","โรงอาหาร"]
["ศุกร์","5","กิจกรรม","พักรับประทานอาหารกลางวัน",null,null,null,"A003","พักกลางวัน","P201",null,"ROOM24","โรงอาหาร"]
["ศุกร์","5","กิจกรรม","พักรับประทานอาหารกลางวัน",null,null,null,"A003","พักกลางวัน","P401",null,"ROOM24","โรงอาหาร"]
["ศุกร์","5","กิจกรรม","พักรับประทานอาหารกลางวัน",null,null,null,"A003","พักกลางวัน","P501",null,"ROOM24","โรงอาหาร"]
["ศุกร์","5","กิจกรรม","พักรับประทานอาหารกลางวัน",null,null,null,"A003","พักกลางวัน","P601",null,"ROOM24","โรงอาหาร"]
["จันทร์","3","วิชาเรียน","ภาษาไทย 1","T001","ครูนลินี",16751052,"ท11101","ไทย1","P101","ป.1/1","ROOM1","ห้อง ป.1/1"]
["จันทร์","4","วิชาเรียน","ดนตรี 1","T001","ครูนลินี",16751052,"ศ11101-2","ดนตรี1","P101","ป.1/1","ROOM1","ห้อง ป.1/1"]
["จันทร์","6","วิชาเรียน","การงานอาชีพและเทคโนโลยี  1","T001","ครูนลินี",16751052,"ง11101-1","กอท1","P101","ป.1/1","ROOM1","ห้อง ป.1/1"]
["จันทร์","7","วิชาเรียน","ภาษาอังกฤษเพิ่มเติม ศัพท์แสนสนุก 1","T007","ครูรุ่งทิวา",16751103,"อ11201","ศัพท์แสนสนุก1","P101","ป.1/1","ROOM9","Soundlab"]
["จันทร์","8","กิจกรรม","ลดเวลาเรียนฯ(เรียนรู้ก้าวไกลกับ ICT)","T005","ครูบุญธรรม",16737945,"ก11905","ICT1","P101","ป.1/1","ROOM7","ห้องคอมฯ"]
["อังคาร","2","วิชาเรียน","ภาษาไทย 1","T001","ครูนลินี",16751052,"ท11101","ไทย1","P101","ป.1/1","ROOM1","ห้อง ป.1/1"]
["อังคาร","3","วิชาเรียน","คณิตศาสตร์ 1","T001","ครูนลินี",16751052,"ค11101","คณิต1","P101","ป.1/1","ROOM1","ห้อง ป.1/1"]
["อังคาร","4","วิชาเรียน","ประวัติศาสตร์ 1","T001","ครูนลินี",16751052,"ส11102","ประวัติ1","P101","ป.1/1","ROOM1","ห้อง ป.1/1"]
["อังคาร","6","วิชาเรียน","ศิลปะ 1","T001","ครูนลินี",16751052,"ศ11101-1","ศิลปะ1","P101","ป.1/1","ROOM1","ห้อง ป.1/1"]
["อังคาร","8","กิจกรรม","ลดเวลาเรียน เพิ่มเวลารู้","T001","ครูนลินี",16751052,"ก11906","ลดเวลาเรียน","P101","ป.1/1","ROOM1","ห้อง ป.1/1"]
["พุธ","8","กิจกรรม","ลดเวลาเรียน เพิ่มเวลารู้","T001","ครูนลินี",16751052,"ก11906","ลดเวลาเรียน","P101","ป.1/1","ROOM1","ห้อง ป.1/1"]
["พฤหัสบดี","8","กิจกรรม","ลดเวลาเรียน เพิ่มเวลารู้","T001","ครูนลินี",16751052,"ก11906","ลดเวลาเรียน","P101","ป.1/1","ROOM1","ห้อง ป.1/1"]
["ศุกร์","8","กิจกรรม","ลดเวลาเรียน เพิ่มเวลารู้","T001","ครูนลินี",16751052,"ก11906","ลดเวลาเรียน","P101","ป.1/1","ROOM1","ห้อง ป.1/1"]
["พุธ","2","วิชาเรียน","ภาษาไทย 1","T001","ครูนลินี",16751052,"ท11101","ไทย1","P101","ป.1/1","ROOM1","ห้อง ป.1/1"]
["พุธ","3","วิชาเรียน","สังคมศึกษา ศาสนาและวัฒนธรรม 1","T001","ครูนลินี",16751052,"ส11101","สังคม1","P101","ป.1/1","ROOM1","ห้อง ป.1/1"]
["พุธ","4","วิชาเรียน","คณิตศาสตร์ 1","T001","ครูนลินี",16751052,"ค11101","คณิต1","P101","ป.1/1","ROOM1","ห้อง ป.1/1"]
["พุธ","6","วิชาเรียน","สุขศึกษา 1","T001","ครูนลินี",16751052,"พ11101-1","สุขะ1","P101","ป.1/1","ROOM1","ห้อง ป.1/1"]
["พฤหัสบดี","2","วิชาเรียน","ภาษาอังกฤษ 1","T007","ครูรุ่งทิวา",16751103,"อ11101","อังกฤษ1","P101","ป.1/1","ROOM9","Soundlab"]
["พฤหัสบดี","3","วิชาเรียน","คณิตศาสตร์ 1","T001","ครูนลินี",16751052,"ค11101","คณิต1","P101","ป.1/1","ROOM1","ห้อง ป.1/1"]
["พฤหัสบดี","4","วิชาเรียน","ภาษาไทย 1","T001","ครูนลินี",16751052,"ท11101","ไทย1","P101","ป.1/1","ROOM1","ห้อง ป.1/1"]
["พฤหัสบดี","6","วิชาเรียน","วิทยาศาสตร์ 1","T008","ครูภิญญาภรณ์",13431551,"ว11101","วิทย์1","P101","ป.1/1","ROOM8","ห้องวิทย์"]
["ศุกร์","2","วิชาเรียน","คณิตศาสตร์ 1","T001","ครูนลินี",16751052,"ค11101","คณิต1","P101","ป.1/1","ROOM1","ห้อง ป.1/1"]
["ศุกร์","3","วิชาเรียน","ภาษาไทย 1","T001","ครูนลินี",16751052,"ท11101","ไทย1","P101","ป.1/1","ROOM1","ห้อง ป.1/1"]
["ศุกร์","4","วิชาเรียน","วิทยาศาสตร์ 1","T008","ครูภิญญาภรณ์",13431551,"ว11101","วิทย์1","P101","ป.1/1","ROOM8","ห้องวิทย์"]
["ศุกร์","6","วิชาเรียน","สังคมศึกษา ศาสนาและวัฒนธรรม 1","T001","ครูนลินี",16751052,"ส11101","สังคม1","P101","ป.1/1","ROOM1","ห้อง ป.1/1"]
["พฤหัสบดี","7","วิชาเรียน","พลศึกษา 1","T001","ครูนลินี",16751052,"พ11101-2","พละ1","P101","ป.1/1","ROOM1","ห้อง ป.1/1"]
["อังคาร","7","กิจกรรม","แนะแนว 1","T001","ครูนลินี",16751052,"ก11901","แนะแนว1","P101","ป.1/1","ROOM1","ห้อง ป.1/1"]
["พุธ","7","กิจกรรม","ลูกเสือ เนตรนารี 1","T001","ครูนลินี",16751052,"ก11902","ลูกเสือ1","P101","ป.1/1","ROOM1","ห้อง ป.1/1"]
["ศุกร์","7","กิจกรรม","ชุมนุม","T001","ครูนลินี",16751052,"ก11903","ชุมนุม1","P101","ป.1/1","ROOM1","ห้อง ป.1/1"]
["จันทร์","2","วิชาเรียน","วิทยาศาสตร์ 2","T008","ครูภิญญาภรณ์",13431551,"ว12101","วิทย์2","P201","ป.2/1","ROOM8","ห้องวิทย์"]
["จันทร์","3","วิชาเรียน","คณิตศาสตร์ 2","T008","ครูภิญญาภรณ์",13431551,"ค12101","คณิต2","P201","ป.2/1","ROOM2","ห้อง ป.2/2"]
["จันทร์","4","วิชาเรียน","ดนตรี 2","T002","ครูปิยพล",12698111,"ศ12101-2","ดนตรี2","P201","ป.2/1","ROOM2","ห้อง ป.2/2"]
["จันทร์","6","วิชาเรียน","ภาษาไทย 2","T002","ครูปิยพล",12698111,"ท12101","ไทย2","P201","ป.2/1","ROOM2","ห้อง ป.2/2"]
["จันทร์","7","วิชาเรียน","สุขศึกษา 2","T002","ครูปิยพล",12698111,"พ12101-1","สุขะ2","P201","ป.2/1","ROOM2","ห้อง ป.2/2"]
["อังคาร","8","กิจกรรม","ลดเวลาเรียนฯ(เรียนรู้ก้าวไกลกับ ICT)","T005","ครูบุญธรรม",16737945,"ก12905","ICT2","P201","ป.2/1","ROOM7","ห้องคอมฯ"]
["อังคาร","2","วิชาเรียน","คณิตศาสตร์ 2","T008","ครูภิญญาภรณ์",13431551,"ค12101","คณิต2","P201","ป.2/1","ROOM2","ห้อง ป.2/2"]
["อังคาร","3","วิชาเรียน","ภาษาไทย 2","T002","ครูปิยพล",12698111,"ท12101","ไทย2","P201","ป.2/1","ROOM2","ห้อง ป.2/2"]
["อังคาร","4","วิชาเรียน","วิทยาศาสตร์ 2","T008","ครูภิญญาภรณ์",13431551,"ว12101","วิทย์2","P201","ป.2/1","ROOM8","ห้องวิทย์"]
["อังคาร","6","วิชาเรียน","ภาษาอังกฤษเพิ่มเติม ศัพท์แสนสนุก 2","T007","ครูรุ่งทิวา",16751103,"อ12201","ศัพท์แสนสนุก2","P201","ป.2/1","ROOM9","Soundlab"]
["อังคาร","7","กิจกรรม","แนะแนว 2","T002","ครูปิยพล",12698111,"ก12901","แนะแนว2","P201","ป.2/1","ROOM2","ห้อง ป.2/2"]
["พุธ","4","วิชาเรียน","ภาษาไทย 2","T002","ครูปิยพล",12698111,"ท12101","ไทย2","P201","ป.2/1","ROOM2","ห้อง ป.2/2"]
["ศุกร์","2","วิชาเรียน","ภาษาไทย 2","T002","ครูปิยพล",12698111,"ท12101","ไทย2","P201","ป.2/1","ROOM2","ห้อง ป.2/2"]
["พฤหัสบดี","3","วิชาเรียน","ภาษาไทย 2","T002","ครูปิยพล",12698111,"ท12101","ไทย2","P201","ป.2/1","ROOM2","ห้อง ป.2/2"]
["พุธ","6","วิชาเรียน","สังคมศึกษา ศาสนาและวัฒนธรรม 2","T002","ครูปิยพล",12698111,"ส12101","สังคม2","P201","ป.2/1","ROOM2","ห้อง ป.2/2"]
["พฤหัสบดี","4","วิชาเรียน","สังคมศึกษา ศาสนาและวัฒนธรรม 2","T002","ครูปิยพล",12698111,"ส12101","สังคม2","P201","ป.2/1","ROOM2","ห้อง ป.2/2"]
["พฤหัสบดี","7","วิชาเรียน","พลศึกษา 2","T002","ครูปิยพล",12698111,"พ12101-2","พละ2","P201","ป.2/1","ROOM2","ห้อง ป.2/2"]
["ศุกร์","6","วิชาเรียน","ศิลปะ 2","T002","ครูปิยพล",12698111,"ศ12101-1","ศิลปะ2","P201","ป.2/1","ROOM2","ห้อง ป.2/2"]
["พฤหัสบดี","6","วิชาเรียน","การงานอาชีพและเทคโนโลยี 2","T002","ครูปิยพล",12698111,"ง12101-1","กอท2","P201","ป.2/1","ROOM2","ห้อง ป.2/2"]
["พุธ","7","กิจกรรม","ลูกเสือ เนตรนารี 2","T002","ครูปิยพล",12698111,"ก12902","ลูกเสือ2","P201","ป.2/1","ROOM2","ห้อง ป.2/2"]
["ศุกร์","7","กิจกรรม","ชุมนุม","T002","ครูปิยพล",12698111,"ก12903","ชุมนุม2","P201","ป.2/1","ROOM2","ห้อง ป.2/2"]
["พุธ","2","วิชาเรียน","ภาษาอังกฤษ 2","T007","ครูรุ่งทิวา",16751103,"อ12101","อังกฤษ2","P201","ป.2/1","ROOM9","Soundlab"]
["ศุกร์","3","วิชาเรียน","คณิตศาสตร์ 2","T008","ครูภิญญาภรณ์",13431551,"ค12101","คณิต2","P201","ป.2/1","ROOM2","ห้อง ป.2/2"]
["ศุกร์","4","วิชาเรียน","ประวัติศาสตร์ 2","T002","ครูปิยพล",12698111,"ส12102","ประวัติ2","P201","ป.2/1","ROOM2","ห้อง ป.2/2"]
["พุธ","3","วิชาเรียน","คณิตศาสตร์ 2","T008","ครูภิญญาภรณ์",13431551,"ค12101","คณิต2","P201","ป.2/1","ROOM2","ห้อง ป.2/2"]
["พฤหัสบดี","2","วิชาเรียน","คณิตศาสตร์ 2","T008","ครูภิญญาภรณ์",13431551,"ค12101","คณิต2","P201","ป.2/1","ROOM2","ห้อง ป.2/2"]
["อังคาร","1","กิจกรรม","กิจกรรมหน้าเสาธง",null,null,null,"A001","หน้าเสาธง","P301","ป.3/1","ROOM16","สนามโรงเรียน"]
["พุธ","1","กิจกรรม","กิจกรรมหน้าเสาธง",null,null,null,"A001","หน้าเสาธง","P301","ป.3/1","ROOM16","สนามโรงเรียน"]
["พฤหัสบดี","1","กิจกรรม","กิจกรรมหน้าเสาธง",null,null,null,"A001","หน้าเสาธง","P301","ป.3/1","ROOM16","สนามโรงเรียน"]
["ศุกร์","1","กิจกรรม","กิจกรรมหน้าเสาธง",null,null,null,"A001","หน้าเสาธง","P301","ป.3/1","ROOM16","สนามโรงเรียน"]
["จันทร์","5","กิจกรรม","พักรับประทานอาหารกลางวัน",null,null,null,"A003","พักกลางวัน","P301","ป.3/1","ROOM24","โรงอาหาร"]
["อังคาร","5","กิจกรรม","พักรับประทานอาหารกลางวัน",null,null,null,"A003","พักกลางวัน","P301","ป.3/1","ROOM24","โรงอาหาร"]
["พุธ","5","กิจกรรม","พักรับประทานอาหารกลางวัน",null,null,null,"A003","พักกลางวัน","P301","ป.3/1","ROOM24","โรงอาหาร"]
["พฤหัสบดี","5","กิจกรรม","พักรับประทานอาหารกลางวัน",null,null,null,"A003","พักกลางวัน","P301","ป.3/1","ROOM24","โรงอาหาร"]
["ศุกร์","5","กิจกรรม","พักรับประทานอาหารกลางวัน",null,null,null,"A003","พักกลางวัน","P301","ป.3/1","ROOM24","โรงอาหาร"]
["จันทร์","2","วิชาเรียน","ภาษาไทย 3","T003","ครูชัยณรงค์",5296274,"ท13101","ไทย3","P301","ป.3/1","ROOM3","ห้อง ป.3/1"]
["อังคาร","2","วิชาเรียน","ภาษาอังกฤษ 3","T007","ครูรุ่งทิวา",16751103,"อ13101","อังกฤษ3","P301","ป.3/1","ROOM9","Soundlab"]
["พุธ","2","วิชาเรียน","คณิตศาสตร์ 3","T003","ครูชัยณรงค์",5296274,"ค13101","คณิต3","P301","ป.3/1","ROOM3","ห้อง ป.3/1"]
["พฤหัสบดี","2","วิชาเรียน","ภาษาไทย 3","T003","ครูชัยณรงค์",5296274,"ท13101","ไทย3","P301","ป.3/1","ROOM3","ห้อง ป.3/1"]
["ศุกร์","2","วิชาเรียน","วิทยาศาสตร์ 3","T008","ครูภิญญาภรณ์",13431551,"ว13101","วิทย์3","P301","ป.3/1","ROOM8","ห้องวิทย์"]
["จันทร์","3","วิชาเรียน","คณิตศาสตร์ 3","T003","ครูชัยณรงค์",5296274,"ค13101","คณิต3","P301","ป.3/1","ROOM3","ห้อง ป.3/1"]
["อังคาร","3","วิชาเรียน","วิทยาศาสตร์ 3","T008","ครูภิญญาภรณ์",13431551,"ว13101","วิทย์3","P301","ป.3/1","ROOM8","ห้องวิทย์"]
["พุธ","3","วิชาเรียน","ภาษาไทย 3","T003","ครูชัยณรงค์",5296274,"ท13101","ไทย3","P301","ป.3/1","ROOM3","ห้อง ป.3/1"]
["พฤหัสบดี","3","วิชาเรียน","สังคมศึกษา ศาสนาและวัฒนธรรม 3","T003","ครูชัยณรงค์",5296274,"ส13101","สังคม3","P301","ป.3/1","ROOM3","ห้อง ป.3/1"]
["ศุกร์","3","วิชาเรียน","คณิตศาสตร์ 3","T003","ครูชัยณรงค์",5296274,"ค13101","คณิต3","P301","ป.3/1","ROOM3","ห้อง ป.3/1"]
["จันทร์","4","วิชาเรียน","สุขศึกษา 3","T003","ครูชัยณรงค์",5296274,"พ13101-1","สุขะ3","P301","ป.3/1","ROOM3","ห้อง ป.3/1"]
["อังคาร","4","วิชาเรียน","คณิตศาสตร์ 3","T003","ครูชัยณรงค์",5296274,"ค13101","คณิต3","P301","ป.3/1","ROOM3","ห้อง ป.3/1"]
["พุธ","4","วิชาเรียน","ภาษาอังกฤษเพิ่มเติม ศัพท์แสนสนุก 3","T007","ครูรุ่งทิวา",16751103,"อ13201","ศัพท์แสนสนุก3","P301","ป.3/1","ROOM9","Soundlab"]
["พฤหัสบดี","4","วิชาเรียน","คณิตศาสตร์ 3","T003","ครูชัยณรงค์",5296274,"ค13101","คณิต3","P301","ป.3/1","ROOM3","ห้อง ป.3/1"]
["ศุกร์","4","วิชาเรียน","ภาษาไทย 3","T003","ครูชัยณรงค์",5296274,"ท13101","ไทย3","P301","ป.3/1","ROOM3","ห้อง ป.3/1"]
["จันทร์","6","วิชาเรียน","ดนตรี 3","T003","ครูชัยณรงค์",5296274,"ศ13101-2","ดนตรี3","P301","ป.3/1","ROOM3","ห้อง ป.3/1"]
["จันทร์","7","วิชาเรียน","สังคมศึกษา ศาสนาและวัฒนธรรม 3","T003","ครูชัยณรงค์",5296274,"ส13101","สังคม3","P301","ป.3/1","ROOM3","ห้อง ป.3/1"]
["จันทร์","8","กิจกรรม","ลดเวลาเรียน เพิ่มเวลารู้","T003","ครูชัยณรงค์",5296274,"ก12906","ลดเวลาเรียน","P301","ป.3/1","ROOM3","ห้อง ป.3/1"]
["อังคาร","8","กิจกรรม","ลดเวลาเรียน เพิ่มเวลารู้","T003","ครูชัยณรงค์",5296274,"ก12906","ลดเวลาเรียน","P301","ป.3/1","ROOM3","ห้อง ป.3/1"]
["พฤหัสบดี","8","กิจกรรม","ลดเวลาเรียน เพิ่มเวลารู้","T003","ครูชัยณรงค์",5296274,"ก12906","ลดเวลาเรียน","P301","ป.3/1","ROOM3","ห้อง ป.3/1"]
["ศุกร์","8","กิจกรรม","ลดเวลาเรียน เพิ่มเวลารู้","T003","ครูชัยณรงค์",5296274,"ก12906","ลดเวลาเรียน","P301","ป.3/1","ROOM3","ห้อง ป.3/1"]
["อังคาร","6","วิชาเรียน","ภาษาไทย 3","T003","ครูชัยณรงค์",5296274,"ท13101","ไทย3","P301","ป.3/1","ROOM3","ห้อง ป.3/1"]
["พุธ","6","วิชาเรียน","ประวัติศาสตร์ 3","T003","ครูชัยณรงค์",5296274,"ส13102","ประวัติ3","P301","ป.3/1","ROOM3","ห้อง ป.3/1"]
["พฤหัสบดี","6","วิชาเรียน","ศิลปะ 3","T003","ครูชัยณรงค์",5296274,"ศ13101-1","ศิลปะ3","P301","ป.3/1","ROOM3","ห้อง ป.3/1"]
["ศุกร์","6","วิชาเรียน","การงานอาชีพและเทคโนโลยี 3","T003","ครูชัยณรงค์",5296274,"ง13101-1","กอท3","P301","ป.3/1","ROOM3","ห้อง ป.3/1"]
["พุธ","8","กิจกรรม","ลดเวลาเรียนฯ(เรียนรู้ก้าวไกลกับ ICT)","T005","ครูบุญธรรม",16737945,"ก12905","ICT2","P301","ป.3/1","ROOM7","ห้องคอมฯ"]
["พุธ","7","กิจกรรม","ลูกเสือ เนตรนารี 2","T003","ครูชัยณรงค์",5296274,"ก12902","ลูกเสือ2","P301","ป.3/1","ROOM3","ห้อง ป.3/1"]
["ศุกร์","7","กิจกรรม","ชุมนุม","T003","ครูชัยณรงค์",5296274,"ก12903","ชุมนุม2","P301","ป.3/1","ROOM3","ห้อง ป.3/1"]
["อังคาร","7","กิจกรรม","แนะแนว 2","T003","ครูชัยณรงค์",5296274,"ก12901","แนะแนว2","P301","ป.3/1","ROOM3","ห้อง ป.3/1"]
["พฤหัสบดี","7","วิชาเรียน","พลศึกษา 3","T003","ครูชัยณรงค์",5296274,"พ13101-2","พละ3","P301","ป.3/1","ROOM3","ห้อง ป.3/1"]
["จันทร์","2","วิชาเรียน","สังคมศึกษา ศาสนาและวัฒนธรรม 4","T004","ครูเกียรติชัย",16764057,"ส14101","สังคม4","P401","ป.4/1","ROOM4","ห้อง ป.4/1"]
["อังคาร","2","วิชาเรียน","คณิตศาสตร์ 4","T004","ครูเกียรติชัย",16764057,"ค14101","คณิต4","P401","ป.4/1","ROOM4","ห้อง ป.4/1"]
["พุธ","2","วิชาเรียน","ภาษาไทย 4","T004","ครูเกียรติชัย",16764057,"ท14101","ไทย4","P401","ป.4/1","ROOM4","ห้อง ป.4/1"]
["พฤหัสบดี","3","วิชาเรียน","วิทยาศาสตร์ 4","T008","ครูภิญญาภรณ์",13431551,"ว14101","วิทย์4","P401","ป.4/1","ROOM8","ห้องวิทย์"]
["พฤหัสบดี","2","วิชาเรียน","คณิตศาสตร์ 4","T004","ครูเกียรติชัย",16764057,"ค14101","คณิต4","P401","ป.4/1","ROOM4","ห้อง ป.4/1"]
["ศุกร์","2","วิชาเรียน","ภาษาอังกฤษ 4","T007","ครูรุ่งทิวา",16751103,"อ14101","อังกฤษ4","P401","ป.4/1","ROOM9","Soundlab"]
["จันทร์","3","วิชาเรียน","ดนตรี 4","T004","ครูเกียรติชัย",16764057,"ศ14101-2","ดนตรี4","P401","ป.4/1","ROOM4","ห้อง ป.4/1"]
["อังคาร","3","วิชาเรียน","ภาษาไทย 4","T004","ครูเกียรติชัย",16764057,"ท14101","ไทย4","P401","ป.4/1","ROOM4","ห้อง ป.4/1"]
["ศุกร์","3","วิชาเรียน","ภาษาไทย 4","T004","ครูเกียรติชัย",16764057,"ท14101","ไทย4","P401","ป.4/1","ROOM4","ห้อง ป.4/1"]
["จันทร์","4","วิชาเรียน","ภาษาไทย 4","T004","ครูเกียรติชัย",16764057,"ท14101","ไทย4","P401","ป.4/1","ROOM4","ห้อง ป.4/1"]
["อังคาร","4","วิชาเรียน","ประวัติศาสตร์ 4","T004","ครูเกียรติชัย",16764057,"ส14102","ประวัติ4","P401","ป.4/1","ROOM4","ห้อง ป.4/1"]
["พฤหัสบดี","4","วิชาเรียน","การงานอาชีพและเทคโนโลยี 4","T004","ครูเกียรติชัย",16764057,"ง14101-1","กอท4","P401","ป.4/1","ROOM4","ห้อง ป.4/1"]
["ศุกร์","4","วิชาเรียน","คณิตศาสตร์ 4","T004","ครูเกียรติชัย",16764057,"ค14101","คณิต4","P401","ป.4/1","ROOM4","ห้อง ป.4/1"]
["จันทร์","6","วิชาเรียน","วิทยาศาสตร์ 4","T008","ครูภิญญาภรณ์",13431551,"ว14101","วิทย์4","P401","ป.4/1","ROOM8","ห้องวิทย์"]
["อังคาร","6","วิชาเรียน","ศิลปะ 4","T004","ครูเกียรติชัย",16764057,"ศ14101-1","ศิลปะ4","P401","ป.4/1","ROOM4","ห้อง ป.4/1"]
["พุธ","6","กิจกรรม","คอมพิวเตอร์ 4","T005","ครูบุญธรรม",16737945,"ง14101-2","คอมพิวเตอร์","P401","ป.4/1","ROOM7","ห้องคอมฯ"]
["ศุกร์","6","วิชาเรียน","สังคมศึกษา ศาสนาและวัฒนธรรม 4","T004","ครูเกียรติชัย",16764057,"ส14101","สังคม4","P401","ป.4/1","ROOM4","ห้อง ป.4/1"]
["จันทร์","8","กิจกรรม","ลดเวลาเรียน เพิ่มเวลารู้","T004","ครูเกียรติชัย",16764057,"ก14906","ลดเวลาเรียน","P401","ป.4/1","ROOM4","ห้อง ป.4/1"]
["อังคาร","8","กิจกรรม","ลดเวลาเรียน เพิ่มเวลารู้","T004","ครูเกียรติชัย",16764057,"ก14906","ลดเวลาเรียน","P401","ป.4/1","ROOM4","ห้อง ป.4/1"]
["พุธ","8","กิจกรรม","ลดเวลาเรียน เพิ่มเวลารู้","T004","ครูเกียรติชัย",16764057,"ก14906","ลดเวลาเรียน","P401","ป.4/1","ROOM4","ห้อง ป.4/1"]
["พฤหัสบดี","8","กิจกรรม","ลดเวลาเรียน เพิ่มเวลารู้","T004","ครูเกียรติชัย",16764057,"ก14906","ลดเวลาเรียน","P401","ป.4/1","ROOM4","ห้อง ป.4/1"]
["ศุกร์","8","กิจกรรม","ลดเวลาเรียน เพิ่มเวลารู้","T004","ครูเกียรติชัย",16764057,"ก14906","ลดเวลาเรียน","P401","ป.4/1","ROOM4","ห้อง ป.4/1"]
["พฤหัสบดี","6","วิชาเรียน","พลศึกษา 4","T006","ครูอุทัย",15773696,"พ14101-2","พละ4","P401","ป.4/1","ROOM4","ห้อง ป.4/1"]
["พฤหัสบดี","7","วิชาเรียน","ภาษาอังกฤษเพิ่มเติม ศัพท์แสนสนุก 4","T007","ครูรุ่งทิวา",16751103,"อ14201","ศัพท์แสนสนุก4","P401","ป.4/1","ROOM9","Soundlab"]
["จันทร์","7","วิชาเรียน","สุขศึกษา 4","T006","ครูอุทัย",15773696,"พ14101-1","สุขะ4","P401","ป.4/1","ROOM4","ห้อง ป.4/1"]
["อังคาร","7","กิจกรรม","แนะแนว 4","T004","ครูเกียรติชัย",16764057,"ก14901","แนะแนว4","P401","ป.4/1","ROOM4","ห้อง ป.4/1"]
["พุธ","7","กิจกรรม","ลูกเสือ เนตรนารี 3","T004","ครูเกียรติชัย",16764057,"ก14902","ลูกเสือ4","P401","ป.4/1","ROOM4","ห้อง ป.4/1"]
["ศุกร์","7","กิจกรรม","ชุมนุม","T004","ครูเกียรติชัย",16764057,"ก14903","ชุมนุม4","P401","ป.4/1","ROOM4","ห้อง ป.4/1"]
["พุธ","7","กิจกรรม","ลูกเสือ เนตรนารี 6","T006","ครูอุทัย",15773696,"ก16902","ลูกเสือ6","P601","ป.6/1","ROOM6","ห้อง ป.6/1"]
["จันทร์","8","กิจกรรม","ลดเวลาเรียน เพิ่มเวลารู้","T006","ครูอุทัย",15773696,"ก16906","ลดเวลาเรียน","P601","ป.6/1","ROOM6","ห้อง ป.6/1"]
["อังคาร","8","กิจกรรม","ลดเวลาเรียน เพิ่มเวลารู้","T006","ครูอุทัย",15773696,"ก16906","ลดเวลาเรียน","P601","ป.6/1","ROOM6","ห้อง ป.6/1"]
["พุธ","8","กิจกรรม","ลดเวลาเรียน เพิ่มเวลารู้","T006","ครูอุทัย",15773696,"ก16906","ลดเวลาเรียน","P601","ป.6/1","ROOM6","ห้อง ป.6/1"]
["พฤหัสบดี","8","กิจกรรม","ลดเวลาเรียน เพิ่มเวลารู้","T006","ครูอุทัย",15773696,"ก16906","ลดเวลาเรียน","P601","ป.6/1","ROOM6","ห้อง ป.6/1"]
["ศุกร์","8","กิจกรรม","ลดเวลาเรียน เพิ่มเวลารู้","T006","ครูอุทัย",15773696,"ก16906","ลดเวลาเรียน","P601","ป.6/1","ROOM6","ห้อง ป.6/1"]
["จันทร์","2","วิชาเรียน","ภาษาไทย 6","T006","ครูอุทัย",15773696,"ท16101","ไทย6","P601","ป.6/1","ROOM6","ห้อง ป.6/1"]
["จันทร์","3","วิชาเรียน","สังคมศึกษา ศาสนาและวัฒนธรรม 6","T006","ครูอุทัย",15773696,"ส16101","สังคม6","P601","ป.6/1","ROOM6","ห้อง ป.6/1"]
["จันทร์","4","วิชาเรียน","คณิตศาสตร์ 6","T006","ครูอุทัย",15773696,"ค16101","คณิต6","P601","ป.6/1","ROOM6","ห้อง ป.6/1"]
["จันทร์","6","วิชาเรียน","ศิลปะ 6","T004","ครูเกียรติชัย",16764057,"ศ16101-1","ศิลปะ6","P601","ป.6/1","ROOM6","ห้อง ป.6/1"]
["อังคาร","2","วิชาเรียน","คณิตศาสตร์ 6","T006","ครูอุทัย",15773696,"ค16101","คณิต6","P601","ป.6/1","ROOM6","ห้อง ป.6/1"]
["อังคาร","3","วิชาเรียน","ภาษาอังกฤษ 6","T007","ครูรุ่งทิวา",16751103,"อ16101","อังกฤษ6","P601","ป.6/1","ROOM9","Soundlab"]
["พฤหัสบดี","6","วิชาเรียน","ดนตรี 6","T004","ครูเกียรติชัย",16764057,"ศ16101-2","ดนตรี6","P601","ป.6/1","ROOM6","ห้อง ป.6/1"]
["อังคาร","6","วิชาเรียน","วิทยาศาสตร์ 6","T008","ครูภิญญาภรณ์",13431551,"ว16101","วิทย์6","P601","ป.6/1","ROOM8","ห้องวิทย์"]
["พุธ","2","วิชาเรียน","สังคมศึกษา ศาสนาและวัฒนธรรม 6","T006","ครูอุทัย",15773696,"ส16101","สังคม6","P601","ป.6/1","ROOM6","ห้อง ป.6/1"]
["พุธ","3","วิชาเรียน","ภาษาไทย 6","T006","ครูอุทัย",15773696,"ท16101","ไทย6","P601","ป.6/1","ROOM6","ห้อง ป.6/1"]
["พฤหัสบดี","2","วิชาเรียน","คณิตศาสตร์ 6","T006","ครูอุทัย",15773696,"ค16101","คณิต6","P601","ป.6/1","ROOM6","ห้อง ป.6/1"]
["พฤหัสบดี","4","วิชาเรียน","วิทยาศาสตร์ 6","T008","ครูภิญญาภรณ์",13431551,"ว16101","วิทย์6","P601","ป.6/1","ROOM8","ห้องวิทย์"]
["พฤหัสบดี","3","วิชาเรียน","ภาษาไทย 6","T006","ครูอุทัย",15773696,"ท16101","ไทย6","P601","ป.6/1","ROOM6","ห้อง ป.6/1"]
["ศุกร์","2","วิชาเรียน","ภาษาไทย 6","T006","ครูอุทัย",15773696,"ท16101","ไทย6","P601","ป.6/1","ROOM6","ห้อง ป.6/1"]
["ศุกร์","3","วิชาเรียน","คณิตศาสตร์ 6","T006","ครูอุทัย",15773696,"ค16101","คณิต6","P601","ป.6/1","ROOM6","ห้อง ป.6/1"]
["ศุกร์","4","วิชาเรียน","สุขศึกษา 6","T006","ครูอุทัย",15773696,"พ16101-1","สุขะ6","P601","ป.6/1","ROOM6","ห้อง ป.6/1"]
["ศุกร์","6","วิชาเรียน","ภาษาอังกฤษ 6","T007","ครูรุ่งทิวา",16751103,"อ16101","อังกฤษ6","P601","ป.6/1","ROOM9","Soundlab"]
["พุธ","6","วิชาเรียน","ภาษาอังกฤษเพิ่มเติม ศัพท์แสนสนุก 6","T007","ครูรุ่งทิวา",16751103,"อ16201","ศัพท์แสนสนุก6","P601","ป.6/1","ROOM9","Soundlab"]
["จันทร์","2","วิชาเรียน","คณิตศาสตร์ 5","T005","ครูบุญธรรม",16737945,"ค15101","คณิต5","P501","ป.5/1","ROOM5","ห้อง ป.5/1"]
["จันทร์","3","วิชาเรียน","ภาษาอังกฤษ 5","T007","ครูรุ่งทิวา",16751103,"อ15101","อังกฤษ5","P501","ป.5/1","ROOM9","Soundlab"]
["จันทร์","4","วิชาเรียน","ดนตรี 5","T005","ครูบุญธรรม",16737945,"ศ15101-2","ดนตรี5","P501","ป.5/1","ROOM5","ห้อง ป.5/1"]
["จันทร์","6","วิชาเรียน","ภาษาไทย 5","T005","ครูบุญธรรม",16737945,"ท15101","ไทย5","P501","ป.5/1","ROOM5","ห้อง ป.5/1"]
["จันทร์","7","วิชาเรียน","วิทยาศาสตร์ 5","T008","ครูภิญญาภรณ์",13431551,"ว15101","วิทย์5","P501","ป.5/1","ROOM8","ห้องวิทย์"]
["จันทร์","8","กิจกรรม","ลดเวลาเรียน เพิ่มเวลารู้","T007","ครูรุ่งทิวา",16751103,"ก15906-1","ลดเวลาเรียน","P501","ป.5/1","ROOM5","ห้อง ป.5/1"]
["อังคาร","2","วิชาเรียน","ภาษาไทย 5","T005","ครูบุญธรรม",16737945,"ท15101","ไทย5","P501","ป.5/1","ROOM5","ห้อง ป.5/1"]
["พุธ","2","วิชาเรียน","วิทยาศาสตร์ 5","T008","ครูภิญญาภรณ์",13431551,"ว15101","วิทย์5","P501","ป.5/1","ROOM8","ห้องวิทย์"]
["พุธ","3","วิชาเรียน","คณิตศาสตร์ 5","T005","ครูบุญธรรม",16737945,"ค15101","คณิต5","P501","ป.5/1","ROOM5","ห้อง ป.5/1"]
["พฤหัสบดี","2","วิชาเรียน","ภาษาไทย 5","T005","ครูบุญธรรม",16737945,"ท15101","ไทย5","P501","ป.5/1","ROOM5","ห้อง ป.5/1"]
["พฤหัสบดี","3","วิชาเรียน","ภาษาอังกฤษ 5","T007","ครูรุ่งทิวา",16751103,"อ15101","อังกฤษ5","P501","ป.5/1","ROOM9","Soundlab"]
["ศุกร์","2","วิชาเรียน","คณิตศาสตร์ 5","T005","ครูบุญธรรม",16737945,"ค15101","คณิต5","P501","ป.5/1","ROOM5","ห้อง ป.5/1"]
["ศุกร์","3","วิชาเรียน","สังคมศึกษา ศาสนาและวัฒนธรรม 5","T007","ครูรุ่งทิวา",16751103,"ส15101","สังคม5","P501","ป.5/1","ROOM5","ห้อง ป.5/1"]
["พฤหัสบดี","7","วิชาเรียน","การงานอาชีพและเทคโนโลยี 6","T005","ครูบุญธรรม",16737945,"ง16101-1","กอท6","P601","ป.6/1","ROOM6","ห้อง ป.6/1"]
["อังคาร","7","วิชาเรียน","พลศึกษา 6","T006","ครูอุทัย",15773696,"พ16101-2","พละ6","P601","ป.6/1","ROOM6","ห้อง ป.6/1"]
["ศุกร์","7","กิจกรรม","ชุมนุม","T006","ครูอุทัย",15773696,"ก16903","ชุมนุม6","P601","ป.6/1","ROOM6","ห้อง ป.6/1"]
["อังคาร","4","วิชาเรียน","ประวัติศาสตร์ 6","T006","ครูอุทัย",15773696,"ส16102","ประวัติ6","P601","ป.6/1","ROOM6","ห้อง ป.6/1"]
["จันทร์","7","วิชาเรียน","คอมพิวเตอร์ 6","T005","ครูบุญธรรม",16737945,"ง16101-2","คอมพิวเตอร์","P601","ป.6/1","ROOM7","ห้องคอมฯ"]
["พุธ","4","กิจกรรม","แนะแนว 6","T006","ครูอุทัย",15773696,"ก16901","แนะแนว6","P601","ป.6/1","ROOM6","ห้อง ป.6/1"]
["พุธ","3","วิชาเรียน","ภาษาอังกฤษ 4","T007","ครูรุ่งทิวา",16751103,"อ14101","อังกฤษ4","P401","ป.4/1","ROOM9","Soundlab"]
["พุธ","4","วิชาเรียน","คณิตศาสตร์ 4","T004","ครูเกียรติชัย",16764057,"ค14101","คณิต4","P401","ป.4/1","ROOM4","ห้อง ป.4/1"]
["อังคาร","8","กิจกรรม","ลดเวลาเรียน เพิ่มเวลารู้","T007","ครูรุ่งทิวา",16751103,"ก15906-1","ลดเวลาเรียน","P501","ป.5/1","ROOM5","ห้อง ป.5/1"]
["พุธ","8","กิจกรรม","ลดเวลาเรียน เพิ่มเวลารู้","T007","ครูรุ่งทิวา",16751103,"ก15906-1","ลดเวลาเรียน","P501","ป.5/1","ROOM5","ห้อง ป.5/1"]
["พฤหัสบดี","8","กิจกรรม","ลดเวลาเรียน เพิ่มเวลารู้","T005","ครูบุญธรรม",16737945,"ก15906-2","ลดเวลาเรียน","P501","ป.5/1","ROOM5","ห้อง ป.5/1"]
["ศุกร์","8","กิจกรรม","ลดเวลาเรียน เพิ่มเวลารู้","T005","ครูบุญธรรม",16737945,"ก15906-2","ลดเวลาเรียน","P501","ป.5/1","ROOM5","ห้อง ป.5/1"]
["อังคาร","7","วิชาเรียน","การงานอาชีพและเทคโนโลยี 5","T005","ครูบุญธรรม",16737945,"ง15101-1","กอท5","P501","ป.5/1","ROOM5","ห้อง ป.5/1"]
["พฤหัสบดี","7","วิชาเรียน","พลศึกษา 5","T006","ครูอุทัย",15773696,"พ15101-2","พละ5","P501","ป.5/1","ROOM5","ห้อง ป.5/1"]
["ศุกร์","7","กิจกรรม","ชุมนุม","T005","ครูบุญธรรม",16737945,"ก15903","ชุมนุม5","P501","ป.5/1","ROOM5","ห้อง ป.5/1"]
["พุธ","7","กิจกรรม","ลูกเสือ เนตรนารี 5","T005","ครูบุญธรรม",16737945,"ก15902","ลูกเสือ5","P501","ป.5/1","ROOM5","ห้อง ป.5/1"]
["อังคาร","6","กิจกรรม","แนะแนว 5","T005","ครูบุญธรรม",16737945,"ก15901","แนะแนว5","P501","ป.5/1","ROOM5","ห้อง ป.5/1"]
["พุธ","6","วิชาเรียน","สุขศึกษา 5","T006","ครูอุทัย",15773696,"พ15101-1","สุขะ5","P501","ป.5/1","ROOM5","ห้อง ป.5/1"]
["ศุกร์","4","วิชาเรียน","ภาษาอังกฤษเพิ่มเติม ศัพท์แสนสนุก 5","T007","ครูรุ่งทิวา",16751103,"อ15201","ศัพท์แสนสนุก5","P501","ป.5/1","ROOM9","Soundlab"]
["พฤหัสบดี","6","วิชาเรียน","ประวัติศาสตร์ 5","T007","ครูรุ่งทิวา",16751103,"ส15102","ประวัติ5","P501","ป.5/1","ROOM5","ห้อง ป.5/1"]
["พุธ","4","วิชาเรียน","ภาษาไทย 5","T005","ครูบุญธรรม",16737945,"ท15101","ไทย5","P501","ป.5/1","ROOM5","ห้อง ป.5/1"]
["อังคาร","4","วิชาเรียน","สังคมศึกษา ศาสนาและวัฒนธรรม 5","T007","ครูรุ่งทิวา",16751103,"ส15101","สังคม5","P501","ป.5/1","ROOM5","ห้อง ป.5/1"]
["อังคาร","3","วิชาเรียน","คณิตศาสตร์ 5","T005","ครูบุญธรรม",16737945,"ค15101","คณิต5","P501","ป.5/1","ROOM5","ห้อง ป.5/1"]
["ศุกร์","6","วิชาเรียน","ศิลปะ 5","T005","ครูบุญธรรม",16737945,"ศ15101-1","ศิลปะ5","P501","ป.5/1","ROOM5","ห้อง ป.5/1"]
["จันทร์","8","กิจกรรม","ลดเวลาเรียน เพิ่มเวลารู้","T008","ครูภิญญาภรณ์",13431551,"ก12906","ลดเวลาเรียน","P201","ป.2/1","ROOM2","ห้อง ป.2/2"]
["พุธ","8","กิจกรรม","ลดเวลาเรียน เพิ่มเวลารู้","T008","ครูภิญญาภรณ์",13431551,"ก12906","ลดเวลาเรียน","P201","ป.2/1","ROOM2","ห้อง ป.2/2"]
["พฤหัสบดี","8","กิจกรรม","ลดเวลาเรียน เพิ่มเวลารู้","T008","ครูภิญญาภรณ์",13431551,"ก12906","ลดเวลาเรียน","P201","ป.2/1","ROOM2","ห้อง ป.2/2"]
["ศุกร์","8","กิจกรรม","ลดเวลาเรียน เพิ่มเวลารู้","T008","ครูภิญญาภรณ์",13431551,"ก12906","ลดเวลาเรียน","P201","ป.2/1","ROOM2","ห้อง ป.2/2"]
["จันทร์",1,"กิจกรรม","กิจกรรมหน้าเสาธง",null,null,null,"A001","หน้าเสาธง","P101","ประถมศึกษาปีที่ 1/1","ROOM16","สนามโรงเรียน"]
["จันทร์",1,"กิจกรรม","กิจกรรมหน้าเสาธง",null,null,null,"A001","หน้าเสาธง","P201","ประถมศึกษาปีที่ 2/1","ROOM16","สนามโรงเรียน"]
["จันทร์",1,"กิจกรรม","กิจกรรมหน้าเสาธง",null,null,null,"A001","หน้าเสาธง","P301","ประถมศึกษาปีที่ 3/1","ROOM16","สนามโรงเรียน"]
["จันทร์",1,"กิจกรรม","กิจกรรมหน้าเสาธง",null,null,null,"A001","หน้าเสาธง","P401","ประถมศึกษาปีที่ 4/1","ROOM16","สนามโรงเรียน"]
["จันทร์",1,"กิจกรรม","กิจกรรมหน้าเสาธง",null,null,null,"A001","หน้าเสาธง","P501","ประถมศึกษาปีที่ 5/1","ROOM16","สนามโรงเรียน"]
["จันทร์",1,"กิจกรรม","กิจกรรมหน้าเสาธง",null,null,null,"A001","หน้าเสาธง","P601","ประถมศึกษาปีที่ 6/1","ROOM16","สนามโรงเรียน"]
["จันทร์",2,"วิชาเรียน","คณิตศาสตร์ 1","T001","ครูนลินี",16751052,"ค11101","คณิต1","P101","ป.1/1","ROOM1","ห้อง ป.1/1"]
["พฤหัสบดี",4,"กิจกรรม","คอมพิวเตอร์ 5","T005","ครูบุญธรรม",16737945,"ง15101-2","คอมพิวเตอร์","P501","ป.5/1","ROOM7","ห้องคอมฯ"]

{"sheet":"จัดตารางสอน","index":10,"n_rows":25,"n_cols":13,"rows_kept":25,"cut":false,"hidden":false,"merged":[[1,3,1,4],[3,0,4,0],[3,1,3,12],[6,0,8,0],[9,0,11,0],[1,5,1,12],[2,0,2,12],[15,0,17,0],[18,0,20,0],[21,0,23,0],[24,0,26,0],[12,0,14,0]]}
[]
["รหัส","P101","ตารางเรียนชั้น","ประถมศึกษาปีที่ 1/1",null,{"$f":"\"ภาคเรียนที่ \"&ตั้งค่า!C11& \" ปีการศึกษา \" & ตั้งค่า!C10 &\" โรงเรียน \" & ตั้งค่า!C12 & \" \"&ตั้งค่า!C14","v":"ภาคเรียนที่ 2 ปีการศึกษา 2559 โรงเรียน บ้านน้ำสอด สำนักงานเขตพื้นที่การศึกษาประถมศึกษาน่าน เขต 2"}]
[]
["วัน",{"$f":"IF(ตั้งค่า!C15=\"ชั่วโมง\",\"ชั่วโมงที่\",\"คาบที่\")","v":"ชั่วโมงที่"}]
[null,1,{"$f":"B5+1","v":2},{"$f":"C5+1","v":3},4,5,6,7,8,9,10,11,12]
["เวลา",{"$f":"ตารางเวลา!$B$2 & \" - \" & ตารางเวลา!$C$2","v":"8.00 - 8.30"},{"$f":"ตารางเวลา!$B$3 & \" - \" & ตารางเวลา!$C$3","v":"8.31 - 9.30"},{"$f":"ตารางเวลา!$B$4 & \" - \" & ตารางเวลา!$C$4","v":"9.31 - 10.30"},{"$f":"ตารางเวลา!$B$5 & \" - \" & ตารางเวลา!$C$5","v":"10.31 - 11.30"},{"$f":"ตารางเวลา!$B$6 & \" - \" & ตารางเวลา!$C$6","v":"11.31 - 12.30"},{"$f":"ตารางเวลา!$B$7 & \" - \" & ตารางเวลา!$C$7","v":"12.31 - 13.30"},{"$f":"ตารางเวลา!$B$8 & \" - \" & ตารางเวลา!$C$8","v":"13.31 - 14.30"},{"$f":"ตารางเวลา!$B$9 & \" - \" & ตารางเวลา!$C$9","v":"14.31 - 15.30"},{"$f":"ตารางเวลา!$B$10 & \" - \" & ตารางเวลา!$C$10","v":" - "},{"$f":"ตารางเวลา!$B$11 & \" - \" & ตารางเวลา!$C$11","v":" - "},{"$f":"ตารางเวลา!$B$12 & \" - \" & ตารางเวลา!$C$12","v":" - "},{"$f":"ตารางเวลา!$B$13 & \" - \" & ตารางเวลา!$C$13","v":" - "}]
["จันทร์","A001","คณิต1","ไทย1","ดนตรี1","A003","กอท1","ศัพท์แสนสนุก1","ก11905"]
[null,"หน้าเสาธง","ครูนลินี","ครูนลินี","ครูนลินี","พักกลางวัน","ครูนลินี","ครูรุ่งทิวา","ICT1"]
[null,"สนามโรงเรียน","ห้อง ป.1/1","ห้อง ป.1/1","ห้อง ป.1/1","โรงอาหาร","ห้อง ป.1/1","Soundlab","ห้องคอมฯ"]
["อังคาร","A001","ไทย1","คณิต1","ประวัติ1","A003","ศิลปะ1","ก11901","ก11906"]
[null,"หน้าเสาธง","ครูนลินี","ครูนลินี","ครูนลินี","พักกลางวัน","ครูนลินี","แนะแนว1","ลดเวลาเรียน"]
[null,"สนามโรงเรียน","ห้อง ป.1/1","ห้อง ป.1/1","ห้อง ป.1/1","โรงอาหาร","ห้อง ป.1/1","ห้อง ป.1/1","ห้อง ป.1/1"]
["พุธ","A001","ไทย1","สังคม1","คณิต1","A003","สุขะ1","ก11902","ก11906"]
[null,"หน้าเสาธง","ครูนลินี","ครูนลินี","ครูนลินี","พักกลางวัน","ครูนลินี","ลูกเสือ1","ลดเวลาเรียน"]
[null,"สนามโรงเรียน","ห้อง ป.1/1","ห้อง ป.1/1","ห้อง ป.1/1","โรงอาหาร","ห้อง ป.1/1","ห้อง ป.1/1","ห้อง ป.1/1"]
["พฤหัสบดี","A001","อังกฤษ1","คณิต1","ไทย1","A003","วิทย์1","พละ1","ก11906"]
[null,"หน้าเสาธง","ครูรุ่งทิวา","ครูนลินี","ครูนลินี","พักกลางวัน","ครูภิญญาภรณ์","ครูนลินี","ลดเวลาเรียน"]
[null,"สนามโรงเรียน","Soundlab","ห้อง ป.1/1","ห้อง ป.1/1","โรงอาหาร","ห้องวิทย์","ห้อง ป.1/1","ห้อง ป.1/1"]
["ศุกร์","A001","คณิต1","ไทย1","วิทย์1","A003","สังคม1","ก11903","ก11906"]
[null,"หน้าเสาธง","ครูนลินี","ครูนลินี","ครูภิญญาภรณ์","พักกลางวัน","ครูนลินี","ชุมนุม1","ลดเวลาเรียน"]
[null,"สนามโรงเรียน","ห้อง ป.1/1","ห้อง ป.1/1","ห้องวิทย์","โรงอาหาร","ห้อง ป.1/1","ห้อง ป.1/1","ห้อง ป.1/1"]
["เสาร์"]
[]
[]
["อาทิตย์"]

{"sheet":"พิมพ์ตารางเรียน","index":11,"n_rows":27,"n_cols":13,"rows_kept":27,"cut":false,"hidden":false,"merged":[[0,0,0,12],[1,0,1,12],[2,0,2,12],[3,1,3,12],[24,0,26,0],[3,0,4,0],[6,0,8,0],[9,0,11,0],[12,0,14,0],[15,0,17,0],[18,0,20,0],[21,0,23,0]]}
[{"$f":"\"โรงเรียน\" & ตั้งค่า!C12 & \" \" & ตั้งค่า!C14","v":"โรงเรียนบ้านน้ำสอด สำนักงานเขตพื้นที่การศึกษาประถมศึกษาน่าน เขต 2"}]
[{"$f":"\"ตารางเรียน \"& จัดตารางสอน!D2 &\"  ภาคเรียนที่ \" & ตั้งค่า!C11 & \" ปีการศึกษา \" & ตั้งค่า!C10","v":"ตารางเรียน ประถมศึกษาปีที่ 1/1  ภาคเรียนที่ 2 ปีการศึกษา 2559"}]
[]
["วัน",{"$f":"IF(ตั้งค่า!C15=\"ชั่วโมง\",\"ชั่วโมงที่\",\"คาบที่\")","v":"ชั่วโมงที่"}]
[null,1,{"$f":"B5+1","v":2},{"$f":"C5+1","v":3},4,5,6,7,8,9,10,11,12]
["เวลา",{"$f":"ตารางเวลา!$B$2 & \" - \" & ตารางเวลา!$C$2","v":"8.00 - 8.30"},{"$f":"ตารางเวลา!$B$3 & \" - \" & ตารางเวลา!$C$3","v":"8.31 - 9.30"},{"$f":"ตารางเวลา!$B$4 & \" - \" & ตารางเวลา!$C$4","v":"9.31 - 10.30"},{"$f":"ตารางเวลา!$B$5 & \" - \" & ตารางเวลา!$C$5","v":"10.31 - 11.30"},{"$f":"ตารางเวลา!$B$6 & \" - \" & ตารางเวลา!$C$6","v":"11.31 - 12.30"},{"$f":"ตารางเวลา!$B$7 & \" - \" & ตารางเวลา!$C$7","v":"12.31 - 13.30"},{"$f":"ตารางเวลา!$B$8 & \" - \" & ตารางเวลา!$C$8","v":"13.31 - 14.30"},{"$f":"ตารางเวลา!$B$9 & \" - \" & ตารางเวลา!$C$9","v":"14.31 - 15.30"},{"$f":"ตารางเวลา!$B$10 & \" - \" & ตารางเวลา!$C$10","v":" - "},{"$f":"ตารางเวลา!$B$11 & \" - \" & ตารางเวลา!$C$11","v":" - "},{"$f":"ตารางเวลา!$B$12 & \" - \" & ตารางเวลา!$C$12","v":" - "},{"$f":"ตารางเวลา!$B$13 & \" - \" & ตารางเวลา!$C$13","v":" - "}]
["จันทร์",{"$f":"IF(จัดตารางสอน!B7=\"\",\"\",จัดตารางสอน!B7)","v":"A001"},{"$f":"IF(จัดตารางสอน!C7=\"\",\"\",จัดตารางสอน!C7)","v":"คณิต1"},{"$f":"IF(จัดตารางสอน!D7=\"\",\"\",จัดตารางสอน!D7)","v":"ไทย1"},{"$f":"IF(จัดตารางสอน!E7=\"\",\"\",จัดตารางสอน!E7)","v":"ดนตรี1"},{"$f":"IF(จัดตารางสอน!F7=\"\",\"\",จัดตารางสอน!F7)","v":"A003"},{"$f":"IF(จัดตารางสอน!G7=\"\",\"\",จัดตารางสอน!G7)","v":"กอท1"},{"$f":"IF(จัดตารางสอน!H7=\"\",\"\",จัดตารางสอน!H7)","v":"ศัพท์แสนสนุก1"},{"$f":"IF(จัดตารางสอน!I7=\"\",\"\",จัดตารางสอน!I7)","v":"ก11905"},{"$f":"IF(จัดตารางสอน!J7=\"\",\"\",จัดตารางสอน!J7)","v":""},{"$f":"IF(จัดตารางสอน!K7=\"\",\"\",จัดตารางสอน!K7)","v":""},{"$f":"IF(จัดตารางสอน!L7=\"\",\"\",จัดตารางสอน!L7)","v":""},{"$f":"IF(จัดตารางสอน!M7=\"\",\"\",จัดตารางสอน!M7)","v":""}]
[null,{"$f":"IF(จัดตารางสอน!B8=\"\",\"\",จัดตารางสอน!B8)","v":"หน้าเสาธง"},{"$f":"IF(จัดตารางสอน!C8=\"\",\"\",จัดตารางสอน!C8)","v":"ครูนลินี"},{"$f":"IF(จัดตารางสอน!D8=\"\",\"\",จัดตารางสอน!D8)","v":"ครูนลินี"},{"$f":"IF(จัดตารางสอน!E8=\"\",\"\",จัดตารางสอน!E8)","v":"ครูนลินี"},{"$f":"IF(จัดตารางสอน!F8=\"\",\"\",จัดตารางสอน!F8)","v":"พักกลางวัน"},{"$f":"IF(จัดตารางสอน!G8=\"\",\"\",จัดตารางสอน!G8)","v":"ครูนลินี"},{"$f":"IF(จัดตารางสอน!H8=\"\",\"\",จัดตารางสอน!H8)","v":"ครูรุ่งทิวา"},{"$f":"IF(จัดตารางสอน!I8=\"\",\"\",จัดตารางสอน!I8)","v":"ICT1"},{"$f":"IF(จัดตารางสอน!J8=\"\",\"\",จัดตารางสอน!J8)","v":""},{"$f":"IF(จัดตารางสอน!K8=\"\",\"\",จัดตารางสอน!K8)","v":""},{"$f":"IF(จัดตารางสอน!L8=\"\",\"\",จัดตารางสอน!L8)","v":""},{"$f":"IF(จัดตารางสอน!M8=\"\",\"\",จัดตารางสอน!M8)","v":""}]
[null,{"$f":"IF(จัดตารางสอน!B9=\"\",\"\",จัดตารางสอน!B9)","v":"สนามโรงเรียน"},{"$f":"IF(จัดตารางสอน!C9=\"\",\"\",จัดตารางสอน!C9)","v":"ห้อง ป.1/1"},{"$f":"IF(จัดตารางสอน!D9=\"\",\"\",จัดตารางสอน!D9)","v":"ห้อง ป.1/1"},{"$f":"IF(จัดตารางสอน!E9=\"\",\"\",จัดตารางสอน!E9)","v":"ห้อง ป.1/1"},{"$f":"IF(จัดตารางสอน!F9=\"\",\"\",จัดตารางสอน!F9)","v":"โรงอาหาร"},{"$f":"IF(จัดตารางสอน!G9=\"\",\"\",จัดตารางสอน!G9)","v":"ห้อง ป.1/1"},{"$f":"IF(จัดตารางสอน!H9=\"\",\"\",จัดตารางสอน!H9)","v":"Soundlab"},{"$f":"IF(จัดตารางสอน!I9=\"\",\"\",จัดตารางสอน!I9)","v":"ห้องคอมฯ"},{"$f":"IF(จัดตารางสอน!J9=\"\",\"\",จัดตารางสอน!J9)","v":""},{"$f":"IF(จัดตารางสอน!K9=\"\",\"\",จัดตารางสอน!K9)","v":""},{"$f":"IF(จัดตารางสอน!L9=\"\",\"\",จัดตารางสอน!L9)","v":""},{"$f":"IF(จัดตารางสอน!M9=\"\",\"\",จัดตารางสอน!M9)","v":""}]
["อังคาร",{"$f":"IF(จัดตารางสอน!B10=\"\",\"\",จัดตารางสอน!B10)","v":"A001"},{"$f":"IF(จัดตารางสอน!C10=\"\",\"\",จัดตารางสอน!C10)","v":"ไทย1"},{"$f":"IF(จัดตารางสอน!D10=\"\",\"\",จัดตารางสอน!D10)","v":"คณิต1"},{"$f":"IF(จัดตารางสอน!E10=\"\",\"\",จัดตารางสอน!E10)","v":"ประวัติ1"},{"$f":"IF(จัดตารางสอน!F10=\"\",\"\",จัดตารางสอน!F10)","v":"A003"},{"$f":"IF(จัดตารางสอน!G10=\"\",\"\",จัดตารางสอน!G10)","v":"ศิลปะ1"},{"$f":"IF(จัดตารางสอน!H10=\"\",\"\",จัดตารางสอน!H10)","v":"ก11901"},{"$f":"IF(จัดตารางสอน!I10=\"\",\"\",จัดตารางสอน!I10)","v":"ก11906"},{"$f":"IF(จัดตารางสอน!J10=\"\",\"\",จัดตารางสอน!J10)","v":""},{"$f":"IF(จัดตารางสอน!K10=\"\",\"\",จัดตารางสอน!K10)","v":""},{"$f":"IF(จัดตารางสอน!L10=\"\",\"\",จัดตารางสอน!L10)","v":""},{"$f":"IF(จัดตารางสอน!M10=\"\",\"\",จัดตารางสอน!M10)","v":""}]
[null,{"$f":"IF(จัดตารางสอน!B11=\"\",\"\",จัดตารางสอน!B11)","v":"หน้าเสาธง"},{"$f":"IF(จัดตารางสอน!C11=\"\",\"\",จัดตารางสอน!C11)","v":"ครูนลินี"},{"$f":"IF(จัดตารางสอน!D11=\"\",\"\",จัดตารางสอน!D11)","v":"ครูนลินี"},{"$f":"IF(จัดตารางสอน!E11=\"\",\"\",จัดตารางสอน!E11)","v":"ครูนลินี"},{"$f":"IF(จัดตารางสอน!F11=\"\",\"\",จัดตารางสอน!F11)","v":"พักกลางวัน"},{"$f":"IF(จัดตารางสอน!G11=\"\",\"\",จัดตารางสอน!G11)","v":"ครูนลินี"},{"$f":"IF(จัดตารางสอน!H11=\"\",\"\",จัดตารางสอน!H11)","v":"แนะแนว1"},{"$f":"IF(จัดตารางสอน!I11=\"\",\"\",จัดตารางสอน!I11)","v":"ลดเวลาเรียน"},{"$f":"IF(จัดตารางสอน!J11=\"\",\"\",จัดตารางสอน!J11)","v":""},{"$f":"IF(จัดตารางสอน!K11=\"\",\"\",จัดตารางสอน!K11)","v":""},{"$f":"IF(จัดตารางสอน!L11=\"\",\"\",จัดตารางสอน!L11)","v":""},{"$f":"IF(จัดตารางสอน!M11=\"\",\"\",จัดตารางสอน!M11)","v":""}]
[null,{"$f":"IF(จัดตารางสอน!B12=\"\",\"\",จัดตารางสอน!B12)","v":"สนามโรงเรียน"},{"$f":"IF(จัดตารางสอน!C12=\"\",\"\",จัดตารางสอน!C12)","v":"ห้อง ป.1/1"},{"$f":"IF(จัดตารางสอน!D12=\"\",\"\",จัดตารางสอน!D12)","v":"ห้อง ป.1/1"},{"$f":"IF(จัดตารางสอน!E12=\"\",\"\",จัดตารางสอน!E12)","v":"ห้อง ป.1/1"},{"$f":"IF(จัดตารางสอน!F12=\"\",\"\",จัดตารางสอน!F12)","v":"โรงอาหาร"},{"$f":"IF(จัดตารางสอน!G12=\"\",\"\",จัดตารางสอน!G12)","v":"ห้อง ป.1/1"},{"$f":"IF(จัดตารางสอน!H12=\"\",\"\",จัดตารางสอน!H12)","v":"ห้อง ป.1/1"},{"$f":"IF(จัดตารางสอน!I12=\"\",\"\",จัดตารางสอน!I12)","v":"ห้อง ป.1/1"},{"$f":"IF(จัดตารางสอน!J12=\"\",\"\",จัดตารางสอน!J12)","v":""},{"$f":"IF(จัดตารางสอน!K12=\"\",\"\",จัดตารางสอน!K12)","v":""},{"$f":"IF(จัดตารางสอน!L12=\"\",\"\",จัดตารางสอน!L12)","v":""},{"$f":"IF(จัดตารางสอน!M12=\"\",\"\",จัดตารางสอน!M12)","v":""}]
["พุธ",{"$f":"IF(จัดตารางสอน!B13=\"\",\"\",จัดตารางสอน!B13)","v":"A001"},{"$f":"IF(จัดตารางสอน!C13=\"\",\"\",จัดตารางสอน!C13)","v":"ไทย1"},{"$f":"IF(จัดตารางสอน!D13=\"\",\"\",จัดตารางสอน!D13)","v":"สังคม1"},{"$f":"IF(จัดตารางสอน!E13=\"\",\"\",จัดตารางสอน!E13)","v":"คณิต1"},{"$f":"IF(จัดตารางสอน!F13=\"\",\"\",จัดตารางสอน!F13)","v":"A003"},{"$f":"IF(จัดตารางสอน!G13=\"\",\"\",จัดตารางสอน!G13)","v":"สุขะ1"},{"$f":"IF(จัดตารางสอน!H13=\"\",\"\",จัดตารางสอน!H13)","v":"ก11902"},{"$f":"IF(จัดตารางสอน!I13=\"\",\"\",จัดตารางสอน!I13)","v":"ก11906"},{"$f":"IF(จัดตารางสอน!J13=\"\",\"\",จัดตารางสอน!J13)","v":""},{"$f":"IF(จัดตารางสอน!K13=\"\",\"\",จัดตารางสอน!K13)","v":""},{"$f":"IF(จัดตารางสอน!L13=\"\",\"\",จัดตารางสอน!L13)","v":""},{"$f":"IF(จัดตารางสอน!M13=\"\",\"\",จัดตารางสอน!M13)","v":""}]
[null,{"$f":"IF(จัดตารางสอน!B14=\"\",\"\",จัดตารางสอน!B14)","v":"หน้าเสาธง"},{"$f":"IF(จัดตารางสอน!C14=\"\",\"\",จัดตารางสอน!C14)","v":"ครูนลินี"},{"$f":"IF(จัดตารางสอน!D14=\"\",\"\",จัดตารางสอน!D14)","v":"ครูนลินี"},{"$f":"IF(จัดตารางสอน!E14=\"\",\"\",จัดตารางสอน!E14)","v":"ครูนลินี"},{"$f":"IF(จัดตารางสอน!F14=\"\",\"\",จัดตารางสอน!F14)","v":"พักกลางวัน"},{"$f":"IF(จัดตารางสอน!G14=\"\",\"\",จัดตารางสอน!G14)","v":"ครูนลินี"},{"$f":"IF(จัดตารางสอน!H14=\"\",\"\",จัดตารางสอน!H14)","v":"ลูกเสือ1"},{"$f":"IF(จัดตารางสอน!I14=\"\",\"\",จัดตารางสอน!I14)","v":"ลดเวลาเรียน"},{"$f":"IF(จัดตารางสอน!J14=\"\",\"\",จัดตารางสอน!J14)","v":""},{"$f":"IF(จัดตารางสอน!K14=\"\",\"\",จัดตารางสอน!K14)","v":""},{"$f":"IF(จัดตารางสอน!L14=\"\",\"\",จัดตารางสอน!L14)","v":""},{"$f":"IF(จัดตารางสอน!M14=\"\",\"\",จัดตารางสอน!M14)","v":""}]
[null,{"$f":"IF(จัดตารางสอน!B15=\"\",\"\",จัดตารางสอน!B15)","v":"สนามโรงเรียน"},{"$f":"IF(จัดตารางสอน!C15=\"\",\"\",จัดตารางสอน!C15)","v":"ห้อง ป.1/1"},{"$f":"IF(จัดตารางสอน!D15=\"\",\"\",จัดตารางสอน!D15)","v":"ห้อง ป.1/1"},{"$f":"IF(จัดตารางสอน!E15=\"\",\"\",จัดตารางสอน!E15)","v":"ห้อง ป.1/1"},{"$f":"IF(จัดตารางสอน!F15=\"\",\"\",จัดตารางสอน!F15)","v":"โรงอาหาร"},{"$f":"IF(จัดตารางสอน!G15=\"\",\"\",จัดตารางสอน!G15)","v":"ห้อง ป.1/1"},{"$f":"IF(จัดตารางสอน!H15=\"\",\"\",จัดตารางสอน!H15)","v":"ห้อง ป.1/1"},{"$f":"IF(จัดตารางสอน!I15=\"\",\"\",จัดตารางสอน!I15)","v":"ห้อง ป.1/1"},{"$f":"IF(จัดตารางสอน!J15=\"\",\"\",จัดตารางสอน!J15)","v":""},{"$f":"IF(จัดตารางสอน!K15=\"\",\"\",จัดตารางสอน!K15)","v":""},{"$f":"IF(จัดตารางสอน!L15=\"\",\"\",จัดตารางสอน!L15)","v":""},{"$f":"IF(จัดตารางสอน!M15=\"\",\"\",จัดตารางสอน!M15)","v":""}]
["พฤหัสบดี",{"$f":"IF(จัดตารางสอน!B16=\"\",\"\",จัดตารางสอน!B16)","v":"A001"},{"$f":"IF(จัดตารางสอน!C16=\"\",\"\",จัดตารางสอน!C16)","v":"อังกฤษ1"},{"$f":"IF(จัดตารางสอน!D16=\"\",\"\",จัดตารางสอน!D16)","v":"คณิต1"},{"$f":"IF(จัดตารางสอน!E16=\"\",\"\",จัดตารางสอน!E16)","v":"ไทย1"},{"$f":"IF(จัดตารางสอน!F16=\"\",\"\",จัดตารางสอน!F16)","v":"A003"},{"$f":"IF(จัดตารางสอน!G16=\"\",\"\",จัดตารางสอน!G16)","v":"วิทย์1"},{"$f":"IF(จัดตารางสอน!H16=\"\",\"\",จัดตารางสอน!H16)","v":"พละ1"},{"$f":"IF(จัดตารางสอน!I16=\"\",\"\",จัดตารางสอน!I16)","v":"ก11906"},{"$f":"IF(จัดตารางสอน!J16=\"\",\"\",จัดตารางสอน!J16)","v":""},{"$f":"IF(จัดตารางสอน!K16=\"\",\"\",จัดตารางสอน!K16)","v":""},{"$f":"IF(จัดตารางสอน!L16=\"\",\"\",จัดตารางสอน!L16)","v":""},{"$f":"IF(จัดตารางสอน!M16=\"\",\"\",จัดตารางสอน!M16)","v":""}]
[null,{"$f":"IF(จัดตารางสอน!B17=\"\",\"\",จัดตารางสอน!B17)","v":"หน้าเสาธง"},{"$f":"IF(จัดตารางสอน!C17=\"\",\"\",จัดตารางสอน!C17)","v":"ครูรุ่งทิวา"},{"$f":"IF(จัดตารางสอน!D17=\"\",\"\",จัดตารางสอน!D17)","v":"ครูนลินี"},{"$f":"IF(จัดตารางสอน!E17=\"\",\"\",จัดตารางสอน!E17)","v":"ครูนลินี"},{"$f":"IF(จัดตารางสอน!F17=\"\",\"\",จัดตารางสอน!F17)","v":"พักกลางวัน"},{"$f":"IF(จัดตารางสอน!G17=\"\",\"\",จัดตารางสอน!G17)","v":"ครูภิญญาภรณ์"},{"$f":"IF(จัดตารางสอน!H17=\"\",\"\",จัดตารางสอน!H17)","v":"ครูนลินี"},{"$f":"IF(จัดตารางสอน!I17=\"\",\"\",จัดตารางสอน!I17)","v":"ลดเวลาเรียน"},{"$f":"IF(จัดตารางสอน!J17=\"\",\"\",จัดตารางสอน!J17)","v":""},{"$f":"IF(จัดตารางสอน!K17=\"\",\"\",จัดตารางสอน!K17)","v":""},{"$f":"IF(จัดตารางสอน!L17=\"\",\"\",จัดตารางสอน!L17)","v":""},{"$f":"IF(จัดตารางสอน!M17=\"\",\"\",จัดตารางสอน!M17)","v":""}]
[null,{"$f":"IF(จัดตารางสอน!B18=\"\",\"\",จัดตารางสอน!B18)","v":"สนามโรงเรียน"},{"$f":"IF(จัดตารางสอน!C18=\"\",\"\",จัดตารางสอน!C18)","v":"Soundlab"},{"$f":"IF(จัดตารางสอน!D18=\"\",\"\",จัดตารางสอน!D18)","v":"ห้อง ป.1/1"},{"$f":"IF(จัดตารางสอน!E18=\"\",\"\",จัดตารางสอน!E18)","v":"ห้อง ป.1/1"},{"$f":"IF(จัดตารางสอน!F18=\"\",\"\",จัดตารางสอน!F18)","v":"โรงอาหาร"},{"$f":"IF(จัดตารางสอน!G18=\"\",\"\",จัดตารางสอน!G18)","v":"ห้องวิทย์"},{"$f":"IF(จัดตารางสอน!H18=\"\",\"\",จัดตารางสอน!H18)","v":"ห้อง ป.1/1"},{"$f":"IF(จัดตารางสอน!I18=\"\",\"\",จัดตารางสอน!I18)","v":"ห้อง ป.1/1"},{"$f":"IF(จัดตารางสอน!J18=\"\",\"\",จัดตารางสอน!J18)","v":""},{"$f":"IF(จัดตารางสอน!K18=\"\",\"\",จัดตารางสอน!K18)","v":""},{"$f":"IF(จัดตารางสอน!L18=\"\",\"\",จัดตารางสอน!L18)","v":""},{"$f":"IF(จัดตารางสอน!M18=\"\",\"\",จัดตารางสอน!M18)","v":""}]
["ศุกร์",{"$f":"IF(จัดตารางสอน!B19=\"\",\"\",จัดตารางสอน!B19)","v":"A001"},{"$f":"IF(จัดตารางสอน!C19=\"\",\"\",จัดตารางสอน!C19)","v":"คณิต1"},{"$f":"IF(จัดตารางสอน!D19=\"\",\"\",จัดตารางสอน!D19)","v":"ไทย1"},{"$f":"IF(จัดตารางสอน!E19=\"\",\"\",จัดตารางสอน!E19)","v":"วิทย์1"},{"$f":"IF(จัดตารางสอน!F19=\"\",\"\",จัดตารางสอน!F19)","v":"A003"},{"$f":"IF(จัดตารางสอน!G19=\"\",\"\",จัดตารางสอน!G19)","v":"สังคม1"},{"$f":"IF(จัดตารางสอน!H19=\"\",\"\",จัดตารางสอน!H19)","v":"ก11903"},{"$f":"IF(จัดตารางสอน!I19=\"\",\"\",จัดตารางสอน!I19)","v":"ก11906"},{"$f":"IF(จัดตารางสอน!J19=\"\",\"\",จัดตารางสอน!J19)","v":""},{"$f":"IF(จัดตารางสอน!K19=\"\",\"\",จัดตารางสอน!K19)","v":""},{"$f":"IF(จัดตารางสอน!L19=\"\",\"\",จัดตารางสอน!L19)","v":""},{"$f":"IF(จัดตารางสอน!M19=\"\",\"\",จัดตารางสอน!M19)","v":""}]
[null,{"$f":"IF(จัดตารางสอน!B20=\"\",\"\",จัดตารางสอน!B20)","v":"หน้าเสาธง"},{"$f":"IF(จัดตารางสอน!C20=\"\",\"\",จัดตารางสอน!C20)","v":"ครูนลินี"},{"$f":"IF(จัดตารางสอน!D20=\"\",\"\",จัดตารางสอน!D20)","v":"ครูนลินี"},{"$f":"IF(จัดตารางสอน!E20=\"\",\"\",จัดตารางสอน!E20)","v":"ครูภิญญาภรณ์"},{"$f":"IF(จัดตารางสอน!F20=\"\",\"\",จัดตารางสอน!F20)","v":"พักกลางวัน"},{"$f":"IF(จัดตารางสอน!G20=\"\",\"\",จัดตารางสอน!G20)","v":"ครูนลินี"},{"$f":"IF(จัดตารางสอน!H20=\"\",\"\",จัดตารางสอน!H20)","v":"ชุมนุม1"},{"$f":"IF(จัดตารางสอน!I20=\"\",\"\",จัดตารางสอน!I20)","v":"ลดเวลาเรียน"},{"$f":"IF(จัดตารางสอน!J20=\"\",\"\",จัดตารางสอน!J20)","v":""},{"$f":"IF(จัดตารางสอน!K20=\"\",\"\",จัดตารางสอน!K20)","v":""},{"$f":"IF(จัดตารางสอน!L20=\"\",\"\",จัดตารางสอน!L20)","v":""},{"$f":"IF(จัดตารางสอน!M20=\"\",\"\",จัดตารางสอน!M20)","v":""}]
[null,{"$f":"IF(จัดตารางสอน!B21=\"\",\"\",จัดตารางสอน!B21)","v":"สนามโรงเรียน"},{"$f":"IF(จัดตารางสอน!C21=\"\",\"\",จัดตารางสอน!C21)","v":"ห้อง ป.1/1"},{"$f":"IF(จัดตารางสอน!D21=\"\",\"\",จัดตารางสอน!D21)","v":"ห้อง ป.1/1"},{"$f":"IF(จัดตารางสอน!E21=\"\",\"\",จัดตารางสอน!E21)","v":"ห้องวิทย์"},{"$f":"IF(จัดตารางสอน!F21=\"\",\"\",จัดตารางสอน!F21)","v":"โรงอาหาร"},{"$f":"IF(จัดตารางสอน!G21=\"\",\"\",จัดตารางสอน!G21)","v":"ห้อง ป.1/1"},{"$f":"IF(จัดตารางสอน!H21=\"\",\"\",จัดตารางสอน!H21)","v":"ห้อง ป.1/1"},{"$f":"IF(จัดตารางสอน!I21=\"\",\"\",จัดตารางสอน!I21)","v":"ห้อง ป.1/1"},{"$f":"IF(จัดตารางสอน!J21=\"\",\"\",จัดตารางสอน!J21)","v":""},{"$f":"IF(จัดตารางสอน!K21=\"\",\"\",จัดตารางสอน!K21)","v":""},{"$f":"IF(จัดตารางสอน!L21=\"\",\"\",จัดตารางสอน!L21)","v":""},{"$f":"IF(จัดตารางสอน!M21=\"\",\"\",จัดตารางสอน!M21)","v":""}]
["เสาร์",{"$f":"IF(จัดตารางสอน!B22=\"\",\"\",จัดตารางสอน!B22)","v":""},{"$f":"IF(จัดตารางสอน!C22=\"\",\"\",จัดตารางสอน!C22)","v":""},{"$f":"IF(จัดตารางสอน!D22=\"\",\"\",จัดตารางสอน!D22)","v":""},{"$f":"IF(จัดตารางสอน!E22=\"\",\"\",จัดตารางสอน!E22)","v":""},{"$f":"IF(จัดตารางสอน!F22=\"\",\"\",จัดตารางสอน!F22)","v":""},{"$f":"IF(จัดตารางสอน!G22=\"\",\"\",จัดตารางสอน!G22)","v":""},{"$f":"IF(จัดตารางสอน!H22=\"\",\"\",จัดตารางสอน!H22)","v":""},{"$f":"IF(จัดตารางสอน!I22=\"\",\"\",จัดตารางสอน!I22)","v":""},{"$f":"IF(จัดตารางสอน!J22=\"\",\"\",จัดตารางสอน!J22)","v":""},{"$f":"IF(จัดตารางสอน!K22=\"\",\"\",จัดตารางสอน!K22)","v":""},{"$f":"IF(จัดตารางสอน!L22=\"\",\"\",จัดตารางสอน!L22)","v":""},{"$f":"IF(จัดตารางสอน!M22=\"\",\"\",จัดตารางสอน!M22)","v":""}]
[null,{"$f":"IF(จัดตารางสอน!B23=\"\",\"\",จัดตารางสอน!B23)","v":""},{"$f":"IF(จัดตารางสอน!C23=\"\",\"\",จัดตารางสอน!C23)","v":""},{"$f":"IF(จัดตารางสอน!D23=\"\",\"\",จัดตารางสอน!D23)","v":""},{"$f":"IF(จัดตารางสอน!E23=\"\",\"\",จัดตารางสอน!E23)","v":""},{"$f":"IF(จัดตารางสอน!F23=\"\",\"\",จัดตารางสอน!F23)","v":""},{"$f":"IF(จัดตารางสอน!G23=\"\",\"\",จัดตารางสอน!G23)","v":""},{"$f":"IF(จัดตารางสอน!H23=\"\",\"\",จัดตารางสอน!H23)","v":""},{"$f":"IF(จัดตารางสอน!I23=\"\",\"\",จัดตารางสอน!I23)","v":""},{"$f":"IF(จัดตารางสอน!J23=\"\",\"\",จัดตารางสอน!J23)","v":""},{"$f":"IF(จัดตารางสอน!K23=\"\",\"\",จัดตารางสอน!K23)","v":""},{"$f":"IF(จัดตารางสอน!L23=\"\",\"\",จัดตารางสอน!L23)","v":""},{"$f":"IF(จัดตารางสอน!M23=\"\",\"\",จัดตารางสอน!M23)","v":""}]
[null,{"$f":"IF(จัดตารางสอน!B24=\"\",\"\",จัดตารางสอน!B24)","v":""},{"$f":"IF(จัดตารางสอน!C24=\"\",\"\",จัดตารางสอน!C24)","v":""},{"$f":"IF(จัดตารางสอน!D24=\"\",\"\",จัดตารางสอน!D24)","v":""},{"$f":"IF(จัดตารางสอน!E24=\"\",\"\",จัดตารางสอน!E24)","v":""},{"$f":"IF(จัดตารางสอน!F24=\"\",\"\",จัดตารางสอน!F24)","v":""},{"$f":"IF(จัดตารางสอน!G24=\"\",\"\",จัดตารางสอน!G24)","v":""},{"$f":"IF(จัดตารางสอน!H24=\"\",\"\",จัดตารางสอน!H24)","v":""},{"$f":"IF(จัดตารางสอน!I24=\"\",\"\",จัดตารางสอน!I24)","v":""},{"$f":"IF(จัดตารางสอน!J24=\"\",\"\",จัดตารางสอน!J24)","v":""},{"$f":"IF(จัดตารางสอน!K24=\"\",\"\",จัดตารางสอน!K24)","v":""},{"$f":"IF(จัดตารางสอน!L24=\"\",\"\",จัดตารางสอน!L24)","v":""},{"$f":"IF(จัดตารางสอน!M24=\"\",\"\",จัดตารางสอน!M24)","v":""}]
["อาทิตย์",{"$f":"IF(จัดตารางสอน!B25=\"\",\"\",จัดตารางสอน!B25)","v":""},{"$f":"IF(จัดตารางสอน!C25=\"\",\"\",จัดตารางสอน!C25)","v":""},{"$f":"IF(จัดตารางสอน!D25=\"\",\"\",จัดตารางสอน!D25)","v":""},{"$f":"IF(จัดตารางสอน!E25=\"\",\"\",จัดตารางสอน!E25)","v":""},{"$f":"IF(จัดตารางสอน!F25=\"\",\"\",จัดตารางสอน!F25)","v":""},{"$f":"IF(จัดตารางสอน!G25=\"\",\"\",จัดตารางสอน!G25)","v":""},{"$f":"IF(จัดตารางสอน!H25=\"\",\"\",จัดตารางสอน!H25)","v":""},{"$f":"IF(จัดตารางสอน!I25=\"\",\"\",จัดตารางสอน!I25)","v":""},{"$f":"IF(จัดตารางสอน!J25=\"\",\"\",จัดตารางสอน!J25)","v":""},{"$f":"IF(จัดตารางสอน!K25=\"\",\"\",จัดตารางสอน!K25)","v":""},{"$f":"IF(จัดตารางสอน!L25=\"\",\"\",จัดตารางสอน!L25)","v":""},{"$f":"IF(จัดตารางสอน!M25=\"\",\"\",จัดตารางสอน!M25)","v":""}]
[null,{"$f":"IF(จัดตารางสอน!B26=\"\",\"\",จัดตารางสอน!B26)","v":""},{"$f":"IF(จัดตารางสอน!C26=\"\",\"\",จัดตารางสอน!C26)","v":""},{"$f":"IF(จัดตารางสอน!D26=\"\",\"\",จัดตารางสอน!D26)","v":""},{"$f":"IF(จัดตารางสอน!E26=\"\",\"\",จัดตารางสอน!E26)","v":""},{"$f":"IF(จัดตารางสอน!F26=\"\",\"\",จัดตารางสอน!F26)","v":""},{"$f":"IF(จัดตารางสอน!G26=\"\",\"\",จัดตารางสอน!G26)","v":""},{"$f":"IF(จัดตารางสอน!H26=\"\",\"\",จัดตารางสอน!H26)","v":""},{"$f":"IF(จัดตารางสอน!I26=\"\",\"\",จัดตารางสอน!I26)","v":""},{"$f":"IF(จัดตารางสอน!J26=\"\",\"\",จัดตารางสอน!J26)","v":""},{"$f":"IF(จัดตารางสอน!K26=\"\",\"\",จัดตารางสอน!K26)","v":""},{"$f":"IF(จัดตารางสอน!L26=\"\",\"\",จัดตารางสอน!L26)","v":""},{"$f":"IF(จัดตารางสอน!M26=\"\",\"\",จัดตารางสอน!M26)","v":""}]
[null,{"$f":"IF(จัดตารางสอน!B27=\"\",\"\",จัดตารางสอน!B27)","v":""},{"$f":"IF(จัดตารางสอน!C27=\"\",\"\",จัดตารางสอน!C27)","v":""},{"$f":"IF(จัดตารางสอน!D27=\"\",\"\",จัดตารางสอน!D27)","v":""},{"$f":"IF(จัดตารางสอน!E27=\"\",\"\",จัดตารางสอน!E27)","v":""},{"$f":"IF(จัดตารางสอน!F27=\"\",\"\",จัดตารางสอน!F27)","v":""},{"$f":"IF(จัดตารางสอน!G27=\"\",\"\",จัดตารางสอน!G27)","v":""},{"$f":"IF(จัดตารางสอน!H27=\"\",\"\",จัดตารางสอน!H27)","v":""},{"$f":"IF(จัดตารางสอน!I27=\"\",\"\",จัดตารางสอน!I27)","v":""},{"$f":"IF(จัดตารางสอน!J27=\"\",\"\",จัดตารางสอน!J27)","v":""},{"$f":"IF(จัดตารางสอน!K27=\"\",\"\",จัดตารางสอน!K27)","v":""},{"$f":"IF(จัดตารางสอน!L27=\"\",\"\",จัดตารางสอน!L27)","v":""},{"$f":"IF(จัดตารางสอน!M27=\"\",\"\",จัดตารางสอน!M27)","v":""}]

{"sheet":"พิมพ์ตารางเรียนแบบย่อส่วน","index":12,"n_rows":86,"n_cols":30,"rows_kept":86,"cut":false,"hidden":false,"merged":[[59,0,59,8],[60,0,60,8],[61,0,61,8],[62,1,62,8],[59,14,59,22],[60,14,60,22],[61,14,61,22],[62,15,62,22],[31,0,31,8],[32,0,32,8],[33,0,33,8],[34,1,34,8],[31,14,31,22],[32,14,32,22],[33,14,33,22],[34,15,34,22],[5,0,5,8],[6,1,6,8],[3,14,3,22],[4,14,4,22],[5,14,5,22],[6,15,6,22],[34,0,35,0],[6,14,7,14],[9,14,11,14],[6,0,7,0],[9,0,11,0],[3,0,3,8],[4,0,4,8],[40,0,42,0],[12,14,14,14],[15,14,17,14],[18,14,20,14],[21,14,23,14],[24,14,26,14],[27,14,29,14],[15,0,17,0],[18,0,20,0],[21,0,23,0],[24,0,26,0],[27,0,29,0],[12,0,14,0],[34,14,35,14],[37,14,39,14],[46,0,48,0],[49,0,51,0],[52,0,54,0],[55,0,57,0],[37,0,39,0],[80,14,82,14],[83,14,85,14],[71,0,73,0],[74,0,76,0],[77,0,79,0],[80,0,82,0],[83,0,85,0],[1,0,1,26],[68,14,70,14],[71,14,73,14],[74,14,76,14],[77,14,79,14],[62,14,63,14],[65,14,67,14],[62,0,63,0],[65,0,67,0],[68,0,70,0],[34,27,36,30],[37,27,39,28],[37,29,39,29],[40,27,42,28],[43,27,45,28],[40,29,42,29],[43,29,45,29],[40,14,42,14],[43,14,45,14],[46,14,48,14],[49,14,51,14],[52,14,54,14],[55,14,57,14],[43,0,45,0]]}
[]
["ตารางเรียนแบบย่อส่วน สำหรับตัดแจกนักเรียน"]
[]
[{"$f":"\"โรงเรียน\" & ตั้งค่า!C12 & \" \" & ตั้งค่า!C14","v":"โรงเรียนบ้านน้ำสอด สำนักงานเขตพื้นที่การศึกษาประถมศึกษาน่าน เขต 2"},null,null,null,null,null,null,null,null,null,null,null,null,null,{"$f":"$A$4","v":"โรงเรียนบ้านน้ำสอด สำนักงานเขตพื้นที่การศึกษาประถมศึกษาน่าน เขต 2"},null,null,null,null,null,null,null,null,null,null,null,null,null," "]
[{"$f":"\"ตารางเรียน \"& จัดตารางสอน!D2 &\"  ภาคเรียนที่ \" & ตั้งค่า!C11 & \" ปีการศึกษา \" & ตั้งค่า!C10","v":"ตารางเรียน ประถมศึกษาปีที่ 1/1  ภาคเรียนที่ 2 ปีการศึกษา 2559"},null,null,null,null,null,null,null,null,null,null,null,null,null,{"$f":"$A$5","v":"ตารางเรียน ประถมศึกษาปีที่ 1/1  ภาคเรียนที่ 2 ปีการศึกษา 2559"}]
[]
["วัน",{"$f":"IF(ตั้งค่า!C15=\"ชั่วโมง\",\"ชั่วโมงที่\",\"คาบที่\")","v":"ชั่วโมงที่"},null,null,null,null,null,null,null,null,null,null,null,null,{"$f":"$A$7","v":"วัน"},{"$f":"B7","v":"ชั่วโมงที่"}]
[null,1,{"$f":"B8+1","v":2},{"$f":"C8+1","v":3},4,5,6,7,8,9,10,11,12,null,null,1,2,3,4,5,6,7,8,9,10,11,12]
["เวลา",{"$f":"ตารางเวลา!$B$2  & \"-\" & ตารางเวลา!$C$2","v":"8.00-8.30"},{"$f":"ตารางเวลา!$B$3 & \"-\" & ตารางเวลา!$C$3","v":"8.31-9.30"},{"$f":"ตารางเวลา!$B$4 & \"-\" & ตารางเวลา!$C$4","v":"9.31-10.30"},{"$f":"ตารางเวลา!$B$5 & \"-\" & ตารางเวลา!$C$5","v":"10.31-11.30"},{"$f":"ตารางเวลา!$B$6 & \"-\" & ตารางเวลา!$C$6","v":"11.31-12.30"},{"$f":"ตารางเวลา!$B$7 & \"-\" & ตารางเวลา!$C$7","v":"12.31-13.30"},{"$f":"ตารางเวลา!$B$8 & \"-\" & ตารางเวลา!$C$8","v":"13.31-14.30"},{"$f":"ตารางเวลา!$B$9 & \"-\" & ตารางเวลา!$C$9","v":"14.31-15.30"},{"$f":"ตารางเวลา!$B$10 & \"-\" & ตารางเวลา!$C$10","v":"-"},{"$f":"ตารางเวลา!$B$11 & \"-\" & ตารางเวลา!$C$11","v":"-"},{"$f":"ตารางเวลา!$B$12 & \"-\" & ตารางเวลา!$C$12","v":"-"},{"$f":"ตารางเวลา!$B$13 & \"-\" & ตารางเวลา!$C$13","v":"-"},null,{"$f":"$A$9","v":"เวลา"},{"$f":"$B$9","v":"8.00-8.30"},{"$f":"$C$9","v":"8.31-9.30"},{"$f":"$D$9","v":"9.31-10.30"},{"$f":"$E$9","v":"10.31-11.30"},{"$f":"$F$9","v":"11.31-12.30"},{"$f":"$G$9","v":"12.31-13.30"},{"$f":"$H$9","v":"13.31-14.30"},{"$f":"$I$9","v":"14.31-15.30"},{"$f":"$J$9","v":"-"},{"$f":"$K$9","v":"-"},{"$f":"$L$9","v":"-"},{"$f":"$M$9","v":"-"}]
["จันทร์",{"$f":"IF(จัดตารางสอน!B7=\"\",\"\",จัดตารางสอน!B7)","v":"A001"},{"$f":"IF(จัดตารางสอน!C7=\"\",\"\",จัดตารางสอน!C7)","v":"คณิต1"},{"$f":"IF(จัดตารางสอน!D7=\"\",\"\",จัดตารางสอน!D7)","v":"ไทย1"},{"$f":"IF(จัดตารางสอน!E7=\"\",\"\",จัดตารางสอน!E7)","v":"ดนตรี1"},{"$f":"IF(จัดตารางสอน!F7=\"\",\"\",จัดตารางสอน!F7)","v":"A003"},{"$f":"IF(จัดตารางสอน!G7=\"\",\"\",จัดตารางสอน!G7)","v":"กอท1"},{"$f":"IF(จัดตารางสอน!H7=\"\",\"\",จัดตารางสอน!H7)","v":"ศัพท์แสนสนุก1"},{"$f":"IF(จัดตารางสอน!I7=\"\",\"\",จัดตารางสอน!I7)","v":"ก11905"},{"$f":"IF(จัดตารางสอน!J7=\"\",\"\",จัดตารางสอน!J7)","v":""},{"$f":"IF(จัดตารางสอน!K7=\"\",\"\",จัดตารางสอน!K7)","v":""},{"$f":"IF(จัดตารางสอน!L7=\"\",\"\",จัดตารางสอน!L7)","v":""},{"$f":"IF(จัดตารางสอน!M7=\"\",\"\",จัดตารางสอน!M7)","v":""},null,{"$f":"$A$10","v":"จันทร์"},{"$f":"$B$10","v":"A001"},{"$f":"$C$10","v":"คณิต1"},{"$f":"$D$10","v":"ไทย1"},{"$f":"$E$10","v":"ดนตรี1"},{"$f":"$F$10","v":"A003"},{"$f":"$G$10","v":"กอท1"},{"$f":"$H$10","v":"ศัพท์แสนสนุก1"},{"$f":"$I$10","v":"ก11905"},{"$f":"$J$10","v":""},{"$f":"$K$10","v":""},{"$f":"$L$10","v":""},{"$f":"$M$10","v":""}]
[null,{"$f":"IF(จัดตารางสอน!B8=\"\",\"\",จัดตารางสอน!B8)","v":"หน้าเสาธง"},{"$f":"IF(จัดตารางสอน!C8=\"\",\"\",จัดตารางสอน!C8)","v":"ครูนลินี"},{"$f":"IF(จัดตารางสอน!D8=\"\",\"\",จัดตารางสอน!D8)","v":"ครูนลินี"},{"$f":"IF(จัดตารางสอน!E8=\"\",\"\",จัดตารางสอน!E8)","v":"ครูนลินี"},{"$f":"IF(จัดตารางสอน!F8=\"\",\"\",จัดตารางสอน!F8)","v":"พักกลางวัน"},{"$f":"IF(จัดตารางสอน!G8=\"\",\"\",จัดตารางสอน!G8)","v":"ครูนลินี"},{"$f":"IF(จัดตารางสอน!H8=\"\",\"\",จัดตารางสอน!H8)","v":"ครูรุ่งทิวา"},{"$f":"IF(จัดตารางสอน!I8=\"\",\"\",จัดตารางสอน!I8)","v":"ICT1"},{"$f":"IF(จัดตารางสอน!J8=\"\",\"\",จัดตารางสอน!J8)","v":""},{"$f":"IF(จัดตารางสอน!K8=\"\",\"\",จัดตารางสอน!K8)","v":""},{"$f":"IF(จัดตารางสอน!L8=\"\",\"\",จัดตารางสอน!L8)","v":""},{"$f":"IF(จัดตารางสอน!M8=\"\",\"\",จัดตารางสอน!M8)","v":""},null,null,{"$f":"$B$11","v":"หน้าเสาธง"},{"$f":"$C$11","v":"ครูนลินี"},{"$f":"$D$11","v":"ครูนลินี"},{"$f":"$E$11","v":"ครูนลินี"},{"$f":"$F$11","v":"พักกลางวัน"},{"$f":"$G$11","v":"ครูนลินี"},{"$f":"$H$11","v":"ครูรุ่งทิวา"},{"$f":"$I$11","v":"ICT1"},{"$f":"$J$11","v":""},{"$f":"$K$11","v":""},{"$f":"$L$11","v":""},{"$f":"$M$11","v":""}]
[null,{"$f":"IF(จัดตารางสอน!B9=\"\",\"\",จัดตารางสอน!B9)","v":"สนามโรงเรียน"},{"$f":"IF(จัดตารางสอน!C9=\"\",\"\",จัดตารางสอน!C9)","v":"ห้อง ป.1/1"},{"$f":"IF(จัดตารางสอน!D9=\"\",\"\",จัดตารางสอน!D9)","v":"ห้อง ป.1/1"},{"$f":"IF(จัดตารางสอน!E9=\"\",\"\",จัดตารางสอน!E9)","v":"ห้อง ป.1/1"},{"$f":"IF(จัดตารางสอน!F9=\"\",\"\",จัดตารางสอน!F9)","v":"โรงอาหาร"},{"$f":"IF(จัดตารางสอน!G9=\"\",\"\",จัดตารางสอน!G9)","v":"ห้อง ป.1/1"},{"$f":"IF(จัดตารางสอน!H9=\"\",\"\",จัดตารางสอน!H9)","v":"Soundlab"},{"$f":"IF(จัดตารางสอน!I9=\"\",\"\",จัดตารางสอน!I9)","v":"ห้องคอมฯ"},{"$f":"IF(จัดตารางสอน!J9=\"\",\"\",จัดตารางสอน!J9)","v":""},{"$f":"IF(จัดตารางสอน!K9=\"\",\"\",จัดตารางสอน!K9)","v":""},{"$f":"IF(จัดตารางสอน!L9=\"\",\"\",จัดตารางสอน!L9)","v":""},{"$f":"IF(จัดตารางสอน!M9=\"\",\"\",จัดตารางสอน!M9)","v":""},null,null,{"$f":"$B$12","v":"สนามโรงเรียน"},{"$f":"$C$12","v":"ห้อง ป.1/1"},{"$f":"$D$12","v":"ห้อง ป.1/1"},{"$f":"$E$12","v":"ห้อง ป.1/1"},{"$f":"$F$12","v":"โรงอาหาร"},{"$f":"$G$12","v":"ห้อง ป.1/1"},{"$f":"$H$12","v":"Soundlab"},{"$f":"$I$12","v":"ห้องคอมฯ"},{"$f":"$J$12","v":""},{"$f":"$K$12","v":""},{"$f":"$L$12","v":""},{"$f":"$M$12","v":""}]
["อังคาร",{"$f":"IF(จัดตารางสอน!B10=\"\",\"\",จัดตารางสอน!B10)","v":"A001"},{"$f":"IF(จัดตารางสอน!C10=\"\",\"\",จัดตารางสอน!C10)","v":"ไทย1"},{"$f":"IF(จัดตารางสอน!D10=\"\",\"\",จัดตารางสอน!D10)","v":"คณิต1"},{"$f":"IF(จัดตารางสอน!E10=\"\",\"\",จัดตารางสอน!E10)","v":"ประวัติ1"},{"$f":"IF(จัดตารางสอน!F10=\"\",\"\",จัดตารางสอน!F10)","v":"A003"},{"$f":"IF(จัดตารางสอน!G10=\"\",\"\",จัดตารางสอน!G10)","v":"ศิลปะ1"},{"$f":"IF(จัดตารางสอน!H10=\"\",\"\",จัดตารางสอน!H10)","v":"ก11901"},{"$f":"IF(จัดตารางสอน!I10=\"\",\"\",จัดตารางสอน!I10)","v":"ก11906"},{"$f":"IF(จัดตารางสอน!J10=\"\",\"\",จัดตารางสอน!J10)","v":""},{"$f":"IF(จัดตารางสอน!K10=\"\",\"\",จัดตารางสอน!K10)","v":""},{"$f":"IF(จัดตารางสอน!L10=\"\",\"\",จัดตารางสอน!L10)","v":""},{"$f":"IF(จัดตารางสอน!M10=\"\",\"\",จัดตารางสอน!M10)","v":""},null,{"$f":"$A$13","v":"อังคาร"},{"$f":"$B$13","v":"A001"},{"$f":"$C$13","v":"ไทย1"},{"$f":"$D$13","v":"คณิต1"},{"$f":"$E$13","v":"ประวัติ1"},{"$f":"$F$13","v":"A003"},{"$f":"$G$13","v":"ศิลปะ1"},{"$f":"$H$13","v":"ก11901"},{"$f":"$I$13","v":"ก11906"},{"$f":"$J$13","v":""},{"$f":"$K$13","v":""},{"$f":"$L$13","v":""},{"$f":"$M$13","v":""}]
[null,{"$f":"IF(จัดตารางสอน!B11=\"\",\"\",จัดตารางสอน!B11)","v":"หน้าเสาธง"},{"$f":"IF(จัดตารางสอน!C11=\"\",\"\",จัดตารางสอน!C11)","v":"ครูนลินี"},{"$f":"IF(จัดตารางสอน!D11=\"\",\"\",จัดตารางสอน!D11)","v":"ครูนลินี"},{"$f":"IF(จัดตารางสอน!E11=\"\",\"\",จัดตารางสอน!E11)","v":"ครูนลินี"},{"$f":"IF(จัดตารางสอน!F11=\"\",\"\",จัดตารางสอน!F11)","v":"พักกลางวัน"},{"$f":"IF(จัดตารางสอน!G11=\"\",\"\",จัดตารางสอน!G11)","v":"ครูนลินี"},{"$f":"IF(จัดตารางสอน!H11=\"\",\"\",จัดตารางสอน!H11)","v":"แนะแนว1"},{"$f":"IF(จัดตารางสอน!I11=\"\",\"\",จัดตารางสอน!I11)","v":"ลดเวลาเรียน"},{"$f":"IF(จัดตารางสอน!J11=\"\",\"\",จัดตารางสอน!J11)","v":""},{"$f":"IF(จัดตารางสอน!K11=\"\",\"\",จัดตารางสอน!K11)","v":""},{"$f":"IF(จัดตารางสอน!L11=\"\",\"\",จัดตารางสอน!L11)","v":""},{"$f":"IF(จัดตารางสอน!M11=\"\",\"\",จัดตารางสอน!M11)","v":""},null,null,{"$f":"$B$14","v":"หน้าเสาธง"},{"$f":"$C$14","v":"ครูนลินี"},{"$f":"$D$14","v":"ครูนลินี"},{"$f":"$E$14","v":"ครูนลินี"},{"$f":"$F$14","v":"พักกลางวัน"},{"$f":"$G$14","v":"ครูนลินี"},{"$f":"$H$14","v":"แนะแนว1"},{"$f":"$I$14","v":"ลดเวลาเรียน"},{"$f":"$J$14","v":""},{"$f":"$K$14","v":""},{"$f":"$L$14","v":""},{"$f":"$M$14","v":""}]
[null,{"$f":"IF(จัดตารางสอน!B12=\"\",\"\",จัดตารางสอน!B12)","v":"สนามโรงเรียน"},{"$f":"IF(จัดตารางสอน!C12=\"\",\"\",จัดตารางสอน!C12)","v":"ห้อง ป.1/1"},{"$f":"IF(จัดตารางสอน!D12=\"\",\"\",จัดตารางสอน!D12)","v":"ห้อง ป.1/1"},{"$f":"IF(จัดตารางสอน!E12=\"\",\"\",จัดตารางสอน!E12)","v":"ห้อง ป.1/1"},{"$f":"IF(จัดตารางสอน!F12=\"\",\"\",จัดตารางสอน!F12)","v":"โรงอาหาร"},{"$f":"IF(จัดตารางสอน!G12=\"\",\"\",จัดตารางสอน!G12)","v":"ห้อง ป.1/1"},{"$f":"IF(จัดตารางสอน!H12=\"\",\"\",จัดตารางสอน!H12)","v":"ห้อง ป.1/1"},{"$f":"IF(จัดตารางสอน!I12=\"\",\"\",จัดตารางสอน!I12)","v":"ห้อง ป.1/1"},{"$f":"IF(จัดตารางสอน!J12=\"\",\"\",จัดตารางสอน!J12)","v":""},{"$f":"IF(จัดตารางสอน!K12=\"\",\"\",จัดตารางสอน!K12)","v":""},{"$f":"IF(จัดตารางสอน!L12=\"\",\"\",จัดตารางสอน!L12)","v":""},{"$f":"IF(จัดตารางสอน!M12=\"\",\"\",จัดตารางสอน!M12)","v":""},null,null,{"$f":"$B$15","v":"สนามโรงเรียน"},{"$f":"$C$15","v":"ห้อง ป.1/1"},{"$f":"$D$15","v":"ห้อง ป.1/1"},{"$f":"$E$15","v":"ห้อง ป.1/1"},{"$f":"$F$15","v":"โรงอาหาร"},{"$f":"$G$15","v":"ห้อง ป.1/1"},{"$f":"$H$15","v":"ห้อง ป.1/1"},{"$f":"$I$15","v":"ห้อง ป.1/1"},{"$f":"$J$15","v":""},{"$f":"$K$15","v":""},{"$f":"$L$15","v":""},{"$f":"$M$15","v":""}]
["พุธ",{"$f":"IF(จัดตารางสอน!B13=\"\",\"\",จัดตารางสอน!B13)","v":"A001"},{"$f":"IF(จัดตารางสอน!C13=\"\",\"\",จัดตารางสอน!C13)","v":"ไทย1"},{"$f":"IF(จัดตารางสอน!D13=\"\",\"\",จัดตารางสอน!D13)","v":"สังคม1"},{"$f":"IF(จัดตารางสอน!E13=\"\",\"\",จัดตารางสอน!E13)","v":"คณิต1"},{"$f":"IF(จัดตารางสอน!F13=\"\",\"\",จัดตารางสอน!F13)","v":"A003"},{"$f":"IF(จัดตารางสอน!G13=\"\",\"\",จัดตารางสอน!G13)","v":"สุขะ1"},{"$f":"IF(จัดตารางสอน!H13=\"\",\"\",จัดตารางสอน!H13)","v":"ก11902"},{"$f":"IF(จัดตารางสอน!I13=\"\",\"\",จัดตารางสอน!I13)","v":"ก11906"},{"$f":"IF(จัดตารางสอน!J13=\"\",\"\",จัดตารางสอน!J13)","v":""},{"$f":"IF(จัดตารางสอน!K13=\"\",\"\",จัดตารางสอน!K13)","v":""},{"$f":"IF(จัดตารางสอน!L13=\"\",\"\",จัดตารางสอน!L13)","v":""},{"$f":"IF(จัดตารางสอน!M13=\"\",\"\",จัดตารางสอน!M13)","v":""},null,{"$f":"$A$16","v":"พุธ"},{"$f":"$B$16","v":"A001"},{"$f":"$C$16","v":"ไทย1"},{"$f":"$D$16","v":"สังคม1"},{"$f":"$E$16","v":"คณิต1"},{"$f":"$F$16","v":"A003"},{"$f":"$G$16","v":"สุขะ1"},{"$f":"$H$16","v":"ก11902"},{"$f":"$I$16","v":"ก11906"},{"$f":"$J$16","v":""},{"$f":"$K$16","v":""},{"$f":"$L$16","v":""},{"$f":"$M$16","v":""}]
[null,{"$f":"IF(จัดตารางสอน!B14=\"\",\"\",จัดตารางสอน!B14)","v":"หน้าเสาธง"},{"$f":"IF(จัดตารางสอน!C14=\"\",\"\",จัดตารางสอน!C14)","v":"ครูนลินี"},{"$f":"IF(จัดตารางสอน!D14=\"\",\"\",จัดตารางสอน!D14)","v":"ครูนลินี"},{"$f":"IF(จัดตารางสอน!E14=\"\",\"\",จัดตารางสอน!E14)","v":"ครูนลินี"},{"$f":"IF(จัดตารางสอน!F14=\"\",\"\",จัดตารางสอน!F14)","v":"พักกลางวัน"},{"$f":"IF(จัดตารางสอน!G14=\"\",\"\",จัดตารางสอน!G14)","v":"ครูนลินี"},{"$f":"IF(จัดตารางสอน!H14=\"\",\"\",จัดตารางสอน!H14)","v":"ลูกเสือ1"},{"$f":"IF(จัดตารางสอน!I14=\"\",\"\",จัดตารางสอน!I14)","v":"ลดเวลาเรียน"},{"$f":"IF(จัดตารางสอน!J14=\"\",\"\",จัดตารางสอน!J14)","v":""},{"$f":"IF(จัดตารางสอน!K14=\"\",\"\",จัดตารางสอน!K14)","v":""},{"$f":"IF(จัดตารางสอน!L14=\"\",\"\",จัดตารางสอน!L14)","v":""},{"$f":"IF(จัดตารางสอน!M14=\"\",\"\",จัดตารางสอน!M14)","v":""},null,null,{"$f":"$B$17","v":"หน้าเสาธง"},{"$f":"$C$17","v":"ครูนลินี"},{"$f":"$D$17","v":"ครูนลินี"},{"$f":"$E$17","v":"ครูนลินี"},{"$f":"$F$17","v":"พักกลางวัน"},{"$f":"$G$17","v":"ครูนลินี"},{"$f":"$H$17","v":"ลูกเสือ1"},{"$f":"$I$17","v":"ลดเวลาเรียน"},{"$f":"$J$17","v":""},{"$f":"$K$17","v":""},{"$f":"$L$17","v":""},{"$f":"$M$17","v":""}]
[null,{"$f":"IF(จัดตารางสอน!B15=\"\",\"\",จัดตารางสอน!B15)","v":"สนามโรงเรียน"},{"$f":"IF(จัดตารางสอน!C15=\"\",\"\",จัดตารางสอน!C15)","v":"ห้อง ป.1/1"},{"$f":"IF(จัดตารางสอน!D15=\"\",\"\",จัดตารางสอน!D15)","v":"ห้อง ป.1/1"},{"$f":"IF(จัดตารางสอน!E15=\"\",\"\",จัดตารางสอน!E15)","v":"ห้อง ป.1/1"},{"$f":"IF(จัดตารางสอน!F15=\"\",\"\",จัดตารางสอน!F15)","v":"โรงอาหาร"},{"$f":"IF(จัดตารางสอน!G15=\"\",\"\",จัดตารางสอน!G15)","v":"ห้อง ป.1/1"},{"$f":"IF(จัดตารางสอน!H15=\"\",\"\",จัดตารางสอน!H15)","v":"ห้อง ป.1/1"},{"$f":"IF(จัดตารางสอน!I15=\"\",\"\",จัดตารางสอน!I15)","v":"ห้อง ป.1/1"},{"$f":"IF(จัดตารางสอน!J15=\"\",\"\",จัดตารางสอน!J15)","v":""},{"$f":"IF(จัดตารางสอน!K15=\"\",\"\",จัดตารางสอน!K15)","v":""},{"$f":"IF(จัดตารางสอน!L15=\"\",\"\",จัดตารางสอน!L15)","v":""},{"$f":"IF(จัดตารางสอน!M15=\"\",\"\",จัดตารางสอน!M15)","v":""},null,null,{"$f":"$B$18","v":"สนามโรงเรียน"},{"$f":"$C$18","v":"ห้อง ป.1/1"},{"$f":"$D$18","v":"ห้อง ป.1/1"},{"$f":"$E$18","v":"ห้อง ป.1/1"},{"$f":"$F$18","v":"โรงอาหาร"},{"$f":"$G$18","v":"ห้อง ป.1/1"},{"$f":"$H$18","v":"ห้อง ป.1/1"},{"$f":"$I$18","v":"ห้อง ป.1/1"},{"$f":"$J$18","v":""},{"$f":"$K$18","v":""},{"$f":"$L$18","v":""},{"$f":"$M$18","v":""}]
["พฤหัสบดี",{"$f":"IF(จัดตารางสอน!B16=\"\",\"\",จัดตารางสอน!B16)","v":"A001"},{"$f":"IF(จัดตารางสอน!C16=\"\",\"\",จัดตารางสอน!C16)","v":"อังกฤษ1"},{"$f":"IF(จัดตารางสอน!D16=\"\",\"\",จัดตารางสอน!D16)","v":"คณิต1"},{"$f":"IF(จัดตารางสอน!E16=\"\",\"\",จัดตารางสอน!E16)","v":"ไทย1"},{"$f":"IF(จัดตารางสอน!F16=\"\",\"\",จัดตารางสอน!F16)","v":"A003"},{"$f":"IF(จัดตารางสอน!G16=\"\",\"\",จัดตารางสอน!G16)","v":"วิทย์1"},{"$f":"IF(จัดตารางสอน!H16=\"\",\"\",จัดตารางสอน!H16)","v":"พละ1"},{"$f":"IF(จัดตารางสอน!I16=\"\",\"\",จัดตารางสอน!I16)","v":"ก11906"},{"$f":"IF(จัดตารางสอน!J16=\"\",\"\",จัดตารางสอน!J16)","v":""},{"$f":"IF(จัดตารางสอน!K16=\"\",\"\",จัดตารางสอน!K16)","v":""},{"$f":"IF(จัดตารางสอน!L16=\"\",\"\",จัดตารางสอน!L16)","v":""},{"$f":"IF(จัดตารางสอน!M16=\"\",\"\",จัดตารางสอน!M16)","v":""},null,{"$f":"$A$19","v":"พฤหัสบดี"},{"$f":"$B$19","v":"A001"},{"$f":"$C$19","v":"อังกฤษ1"},{"$f":"$D$19","v":"คณิต1"},{"$f":"$E$19","v":"ไทย1"},{"$f":"$F$19","v":"A003"},{"$f":"$G$19","v":"วิทย์1"},{"$f":"$H$19","v":"พละ1"},{"$f":"$I$19","v":"ก11906"},{"$f":"$J$19","v":""},{"$f":"$K$19","v":""},{"$f":"$L$19","v":""},{"$f":"$M$19","v":""}]
[null,{"$f":"IF(จัดตารางสอน!B17=\"\",\"\",จัดตารางสอน!B17)","v":"หน้าเสาธง"},{"$f":"IF(จัดตารางสอน!C17=\"\",\"\",จัดตารางสอน!C17)","v":"ครูรุ่งทิวา"},{"$f":"IF(จัดตารางสอน!D17=\"\",\"\",จัดตารางสอน!D17)","v":"ครูนลินี"},{"$f":"IF(จัดตารางสอน!E17=\"\",\"\",จัดตารางสอน!E17)","v":"ครูนลินี"},{"$f":"IF(จัดตารางสอน!F17=\"\",\"\",จัดตารางสอน!F17)","v":"พักกลางวัน"},{"$f":"IF(จัดตารางสอน!G17=\"\",\"\",จัดตารางสอน!G17)","v":"ครูภิญญาภรณ์"},{"$f":"IF(จัดตารางสอน!H17=\"\",\"\",จัดตารางสอน!H17)","v":"ครูนลินี"},{"$f":"IF(จัดตารางสอน!I17=\"\",\"\",จัดตารางสอน!I17)","v":"ลดเวลาเรียน"},{"$f":"IF(จัดตารางสอน!J17=\"\",\"\",จัดตารางสอน!J17)","v":""},{"$f":"IF(จัดตารางสอน!K17=\"\",\"\",จัดตารางสอน!K17)","v":""},{"$f":"IF(จัดตารางสอน!L17=\"\",\"\",จัดตารางสอน!L17)","v":""},{"$f":"IF(จัดตารางสอน!M17=\"\",\"\",จัดตารางสอน!M17)","v":""},null,null,{"$f":"$B$20","v":"หน้าเสาธง"},{"$f":"$C$20","v":"ครูรุ่งทิวา"},{"$f":"$D$20","v":"ครูนลินี"},{"$f":"$E$20","v":"ครูนลินี"},{"$f":"$F$20","v":"พักกลางวัน"},{"$f":"$G$20","v":"ครูภิญญาภรณ์"},{"$f":"$H$20","v":"ครูนลินี"},{"$f":"$I$20","v":"ลดเวลาเรียน"},{"$f":"$J$20","v":""},{"$f":"$K$20","v":""},{"$f":"$L$20","v":""},{"$f":"$M$20","v":""}]
[null,{"$f":"IF(จัดตารางสอน!B18=\"\",\"\",จัดตารางสอน!B18)","v":"สนามโรงเรียน"},{"$f":"IF(จัดตารางสอน!C18=\"\",\"\",จัดตารางสอน!C18)","v":"Soundlab"},{"$f":"IF(จัดตารางสอน!D18=\"\",\"\",จัดตารางสอน!D18)","v":"ห้อง ป.1/1"},{"$f":"IF(จัดตารางสอน!E18=\"\",\"\",จัดตารางสอน!E18)","v":"ห้อง ป.1/1"},{"$f":"IF(จัดตารางสอน!F18=\"\",\"\",จัดตารางสอน!F18)","v":"โรงอาหาร"},{"$f":"IF(จัดตารางสอน!G18=\"\",\"\",จัดตารางสอน!G18)","v":"ห้องวิทย์"},{"$f":"IF(จัดตารางสอน!H18=\"\",\"\",จัดตารางสอน!H18)","v":"ห้อง ป.1/1"},{"$f":"IF(จัดตารางสอน!I18=\"\",\"\",จัดตารางสอน!I18)","v":"ห้อง ป.1/1"},{"$f":"IF(จัดตารางสอน!J18=\"\",\"\",จัดตารางสอน!J18)","v":""},{"$f":"IF(จัดตารางสอน!K18=\"\",\"\",จัดตารางสอน!K18)","v":""},{"$f":"IF(จัดตารางสอน!L18=\"\",\"\",จัดตารางสอน!L18)","v":""},{"$f":"IF(จัดตารางสอน!M18=\"\",\"\",จัดตารางสอน!M18)","v":""},null,null,{"$f":"$B$21","v":"สนามโรงเรียน"},{"$f":"$C$21","v":"Soundlab"},{"$f":"$D$21","v":"ห้อง ป.1/1"},{"$f":"$E$21","v":"ห้อง ป.1/1"},{"$f":"$F$21","v":"โรงอาหาร"},{"$f":"$G$21","v":"ห้องวิทย์"},{"$f":"$H$21","v":"ห้อง ป.1/1"},{"$f":"$I$21","v":"ห้อง ป.1/1"},{"$f":"$J$21","v":""},{"$f":"$K$21","v":""},{"$f":"$L$21","v":""},{"$f":"$M$21","v":""}]
["ศุกร์",{"$f":"IF(จัดตารางสอน!B19=\"\",\"\",จัดตารางสอน!B19)","v":"A001"},{"$f":"IF(จัดตารางสอน!C19=\"\",\"\",จัดตารางสอน!C19)","v":"คณิต1"},{"$f":"IF(จัดตารางสอน!D19=\"\",\"\",จัดตารางสอน!D19)","v":"ไทย1"},{"$f":"IF(จัดตารางสอน!E19=\"\",\"\",จัดตารางสอน!E19)","v":"วิทย์1"},{"$f":"IF(จัดตารางสอน!F19=\"\",\"\",จัดตารางสอน!F19)","v":"A003"},{"$f":"IF(จัดตารางสอน!G19=\"\",\"\",จัดตารางสอน!G19)","v":"สังคม1"},{"$f":"IF(จัดตารางสอน!H19=\"\",\"\",จัดตารางสอน!H19)","v":"ก11903"},{"$f":"IF(จัดตารางสอน!I19=\"\",\"\",จัดตารางสอน!I19)","v":"ก11906"},{"$f":"IF(จัดตารางสอน!J19=\"\",\"\",จัดตารางสอน!J19)","v":""},{"$f":"IF(จัดตารางสอน!K19=\"\",\"\",จัดตารางสอน!K19)","v":""},{"$f":"IF(จัดตารางสอน!L19=\"\",\"\",จัดตารางสอน!L19)","v":""},{"$f":"IF(จัดตารางสอน!M19=\"\",\"\",จัดตารางสอน!M19)","v":""},null,{"$f":"$A$22","v":"ศุกร์"},{"$f":"$B$22","v":"A001"},{"$f":"$C$22","v":"คณิต1"},{"$f":"$D$22","v":"ไทย1"},{"$f":"$E$22","v":"วิทย์1"},{"$f":"$F$22","v":"A003"},{"$f":"$G$22","v":"สังคม1"},{"$f":"$H$22","v":"ก11903"},{"$f":"$I$22","v":"ก11906"},{"$f":"$J$22","v":""},{"$f":"$K$22","v":""},{"$f":"$L$22","v":""},{"$f":"$M$22","v":""}]
[null,{"$f":"IF(จัดตารางสอน!B20=\"\",\"\",จัดตารางสอน!B20)","v":"หน้าเสาธง"},{"$f":"IF(จัดตารางสอน!C20=\"\",\"\",จัดตารางสอน!C20)","v":"ครูนลินี"},{"$f":"IF(จัดตารางสอน!D20=\"\",\"\",จัดตารางสอน!D20)","v":"ครูนลินี"},{"$f":"IF(จัดตารางสอน!E20=\"\",\"\",จัดตารางสอน!E20)","v":"ครูภิญญาภรณ์"},{"$f":"IF(จัดตารางสอน!F20=\"\",\"\",จัดตารางสอน!F20)","v":"พักกลางวัน"},{"$f":"IF(จัดตารางสอน!G20=\"\",\"\",จัดตารางสอน!G20)","v":"ครูนลินี"},{"$f":"IF(จัดตารางสอน!H20=\"\",\"\",จัดตารางสอน!H20)","v":"ชุมนุม1"},{"$f":"IF(จัดตารางสอน!I20=\"\",\"\",จัดตารางสอน!I20)","v":"ลดเวลาเรียน"},{"$f":"IF(จัดตารางสอน!J20=\"\",\"\",จัดตารางสอน!J20)","v":""},{"$f":"IF(จัดตารางสอน!K20=\"\",\"\",จัดตารางสอน!K20)","v":""},{"$f":"IF(จัดตารางสอน!L20=\"\",\"\",จัดตารางสอน!L20)","v":""},{"$f":"IF(จัดตารางสอน!M20=\"\",\"\",จัดตารางสอน!M20)","v":""},null,null,{"$f":"$B$23","v":"หน้าเสาธง"},{"$f":"$C$23","v":"ครูนลินี"},{"$f":"$D$23","v":"ครูนลินี"},{"$f":"$E$23","v":"ครูภิญญาภรณ์"},{"$f":"$F$23","v":"พักกลางวัน"},{"$f":"$G$23","v":"ครูนลินี"},{"$f":"$H$23","v":"ชุมนุม1"},{"$f":"$I$23","v":"ลดเวลาเรียน"},{"$f":"$J$23","v":""},{"$f":"$K$23","v":""},{"$f":"$L$23","v":""},{"$f":"$M$23","v":""}]
[null,{"$f":"IF(จัดตารางสอน!B21=\"\",\"\",จัดตารางสอน!B21)","v":"สนามโรงเรียน"},{"$f":"IF(จัดตารางสอน!C21=\"\",\"\",จัดตารางสอน!C21)","v":"ห้อง ป.1/1"},{"$f":"IF(จัดตารางสอน!D21=\"\",\"\",จัดตารางสอน!D21)","v":"ห้อง ป.1/1"},{"$f":"IF(จัดตารางสอน!E21=\"\",\"\",จัดตารางสอน!E21)","v":"ห้องวิทย์"},{"$f":"IF(จัดตารางสอน!F21=\"\",\"\",จัดตารางสอน!F21)","v":"โรงอาหาร"},{"$f":"IF(จัดตารางสอน!G21=\"\",\"\",จัดตารางสอน!G21)","v":"ห้อง ป.1/1"},{"$f":"IF(จัดตารางสอน!H21=\"\",\"\",จัดตารางสอน!H21)","v":"ห้อง ป.1/1"},{"$f":"IF(จัดตารางสอน!I21=\"\",\"\",จัดตารางสอน!I21)","v":"ห้อง ป.1/1"},{"$f":"IF(จัดตารางสอน!J21=\"\",\"\",จัดตารางสอน!J21)","v":""},{"$f":"IF(จัดตารางสอน!K21=\"\",\"\",จัดตารางสอน!K21)","v":""},{"$f":"IF(จัดตารางสอน!L21=\"\",\"\",จัดตารางสอน!L21)","v":""},{"$f":"IF(จัดตารางสอน!M21=\"\",\"\",จัดตารางสอน!M21)","v":""},null,null,{"$f":"$B$24","v":"สนามโรงเรียน"},{"$f":"$C$24","v":"ห้อง ป.1/1"},{"$f":"$D$24","v":"ห้อง ป.1/1"},{"$f":"$E$24","v":"ห้องวิทย์"},{"$f":"$F$24","v":"โรงอาหาร"},{"$f":"$G$24","v":"ห้อง ป.1/1"},{"$f":"$H$24","v":"ห้อง ป.1/1"},{"$f":"$I$24","v":"ห้อง ป.1/1"},{"$f":"$J$24","v":""},{"$f":"$K$24","v":""},{"$f":"$L$24","v":""},{"$f":"$M$24","v":""}]
["เสาร์",{"$f":"IF(จัดตารางสอน!B22=\"\",\"\",จัดตารางสอน!B22)","v":""},{"$f":"IF(จัดตารางสอน!C22=\"\",\"\",จัดตารางสอน!C22)","v":""},{"$f":"IF(จัดตารางสอน!D22=\"\",\"\",จัดตารางสอน!D22)","v":""},{"$f":"IF(จัดตารางสอน!E22=\"\",\"\",จัดตารางสอน!E22)","v":""},{"$f":"IF(จัดตารางสอน!F22=\"\",\"\",จัดตารางสอน!F22)","v":""},{"$f":"IF(จัดตารางสอน!G22=\"\",\"\",จัดตารางสอน!G22)","v":""},{"$f":"IF(จัดตารางสอน!H22=\"\",\"\",จัดตารางสอน!H22)","v":""},{"$f":"IF(จัดตารางสอน!I22=\"\",\"\",จัดตารางสอน!I22)","v":""},{"$f":"IF(จัดตารางสอน!J22=\"\",\"\",จัดตารางสอน!J22)","v":""},{"$f":"IF(จัดตารางสอน!K22=\"\",\"\",จัดตารางสอน!K22)","v":""},{"$f":"IF(จัดตารางสอน!L22=\"\",\"\",จัดตารางสอน!L22)","v":""},{"$f":"IF(จัดตารางสอน!M22=\"\",\"\",จัดตารางสอน!M22)","v":""},null,{"$f":"$A$25","v":"เสาร์"},{"$f":"$B$25","v":""},{"$f":"$C$25","v":""},{"$f":"$D$25","v":""},{"$f":"$E$25","v":""},{"$f":"$F$25","v":""},{"$f":"$G$25","v":""},{"$f":"$H$25","v":""},{"$f":"$I$25","v":""},{"$f":"$J$25","v":""},{"$f":"$K$25","v":""},{"$f":"$L$25","v":""},{"$f":"$M$25","v":""}]
[null,{"$f":"IF(จัดตารางสอน!B23=\"\",\"\",จัดตารางสอน!B23)","v":""},{"$f":"IF(จัดตารางสอน!C23=\"\",\"\",จัดตารางสอน!C23)","v":""},{"$f":"IF(จัดตารางสอน!D23=\"\",\"\",จัดตารางสอน!D23)","v":""},{"$f":"IF(จัดตารางสอน!E23=\"\",\"\",จัดตารางสอน!E23)","v":""},{"$f":"IF(จัดตารางสอน!F23=\"\",\"\",จัดตารางสอน!F23)","v":""},{"$f":"IF(จัดตารางสอน!G23=\"\",\"\",จัดตารางสอน!G23)","v":""},{"$f":"IF(จัดตารางสอน!H23=\"\",\"\",จัดตารางสอน!H23)","v":""},{"$f":"IF(จัดตารางสอน!I23=\"\",\"\",จัดตารางสอน!I23)","v":""},{"$f":"IF(จัดตารางสอน!J23=\"\",\"\",จัดตารางสอน!J23)","v":""},{"$f":"IF(จัดตารางสอน!K23=\"\",\"\",จัดตารางสอน!K23)","v":""},{"$f":"IF(จัดตารางสอน!L23=\"\",\"\",จัดตารางสอน!L23)","v":""},{"$f":"IF(จัดตารางสอน!M23=\"\",\"\",จัดตารางสอน!M23)","v":""},null,null,{"$f":"$B$26","v":""},{"$f":"$C$26","v":""},{"$f":"$D$26","v":""},{"$f":"$E$26","v":""},{"$f":"$F$26","v":""},{"$f":"$G$26","v":""},{"$f":"$H$26","v":""},{"$f":"$I$26","v":""},{"$f":"$J$26","v":""},{"$f":"$K$26","v":""},{"$f":"$L$26","v":""},{"$f":"$M$26","v":""}]
[null,{"$f":"IF(จัดตารางสอน!B24=\"\",\"\",จัดตารางสอน!B24)","v":""},{"$f":"IF(จัดตารางสอน!C24=\"\",\"\",จัดตารางสอน!C24)","v":""},{"$f":"IF(จัดตารางสอน!D24=\"\",\"\",จัดตารางสอน!D24)","v":""},{"$f":"IF(จัดตารางสอน!E24=\"\",\"\",จัดตารางสอน!E24)","v":""},{"$f":"IF(จัดตารางสอน!F24=\"\",\"\",จัดตารางสอน!F24)","v":""},{"$f":"IF(จัดตารางสอน!G24=\"\",\"\",จัดตารางสอน!G24)","v":""},{"$f":"IF(จัดตารางสอน!H24=\"\",\"\",จัดตารางสอน!H24)","v":""},{"$f":"IF(จัดตารางสอน!I24=\"\",\"\",จัดตารางสอน!I24)","v":""},{"$f":"IF(จัดตารางสอน!J24=\"\",\"\",จัดตารางสอน!J24)","v":""},{"$f":"IF(จัดตารางสอน!K24=\"\",\"\",จัดตารางสอน!K24)","v":""},{"$f":"IF(จัดตารางสอน!L24=\"\",\"\",จัดตารางสอน!L24)","v":""},{"$f":"IF(จัดตารางสอน!M24=\"\",\"\",จัดตารางสอน!M24)","v":""},null,null,{"$f":"$B$27","v":""},{"$f":"$C$27","v":""},{"$f":"$D$27","v":""},{"$f":"$E$27","v":""},{"$f":"$F$27","v":""},{"$f":"$G$27","v":""},{"$f":"$H$27","v":""},{"$f":"$I$27","v":""},{"$f":"$J$27","v":""},{"$f":"$K$27","v":""},{"$f":"$L$27","v":""},{"$f":"$M$27","v":""}]
["อาทิตย์",{"$f":"IF(จัดตารางสอน!B25=\"\",\"\",จัดตารางสอน!B25)","v":""},{"$f":"IF(จัดตารางสอน!C25=\"\",\"\",จัดตารางสอน!C25)","v":""},{"$f":"IF(จัดตารางสอน!D25=\"\",\"\",จัดตารางสอน!D25)","v":""},{"$f":"IF(จัดตารางสอน!E25=\"\",\"\",จัดตารางสอน!E25)","v":""},{"$f":"IF(จัดตารางสอน!F25=\"\",\"\",จัดตารางสอน!F25)","v":""},{"$f":"IF(จัดตารางสอน!G25=\"\",\"\",จัดตารางสอน!G25)","v":""},{"$f":"IF(จัดตารางสอน!H25=\"\",\"\",จัดตารางสอน!H25)","v":""},{"$f":"IF(จัดตารางสอน!I25=\"\",\"\",จัดตารางสอน!I25)","v":""},{"$f":"IF(จัดตารางสอน!J25=\"\",\"\",จัดตารางสอน!J25)","v":""},{"$f":"IF(จัดตารางสอน!K25=\"\",\"\",จัดตารางสอน!K25)","v":""},{"$f":"IF(จัดตารางสอน!L25=\"\",\"\",จัดตารางสอน!L25)","v":""},{"$f":"IF(จัดตารางสอน!M25=\"\",\"\",จัดตารางสอน!M25)","v":""},null,{"$f":"$A$28","v":"อาทิตย์"},{"$f":"$B$28","v":""},{"$f":"$C$28","v":""},{"$f":"$D$28","v":""},{"$f":"$E$28","v":""},{"$f":"$F$28","v":""},{"$f":"$G$28","v":""},{"$f":"$H$28","v":""},{"$f":"$I$28","v":""},{"$f":"$J$28","v":""},{"$f":"$K$28","v":""},{"$f":"$L$28","v":""},{"$f":"$M$28","v":""}]
[null,{"$f":"IF(จัดตารางสอน!B26=\"\",\"\",จัดตารางสอน!B26)","v":""},{"$f":"IF(จัดตารางสอน!C26=\"\",\"\",จัดตารางสอน!C26)","v":""},{"$f":"IF(จัดตารางสอน!D26=\"\",\"\",จัดตารางสอน!D26)","v":""},{"$f":"IF(จัดตารางสอน!E26=\"\",\"\",จัดตารางสอน!E26)","v":""},{"$f":"IF(จัดตารางสอน!F26=\"\",\"\",จัดตารางสอน!F26)","v":""},{"$f":"IF(จัดตารางสอน!G26=\"\",\"\",จัดตารางสอน!G26)","v":""},{"$f":"IF(จัดตารางสอน!H26=\"\",\"\",จัดตารางสอน!H26)","v":""},{"$f":"IF(จัดตารางสอน!I26=\"\",\"\",จัดตารางสอน!I26)","v":""},{"$f":"IF(จัดตารางสอน!J26=\"\",\"\",จัดตารางสอน!J26)","v":""},{"$f":"IF(จัดตารางสอน!K26=\"\",\"\",จัดตารางสอน!K26)","v":""},{"$f":"IF(จัดตารางสอน!L26=\"\",\"\",จัดตารางสอน!L26)","v":""},{"$f":"IF(จัดตารางสอน!M26=\"\",\"\",จัดตารางสอน!M26)","v":""},null,null,{"$f":"$B$29","v":""},{"$f":"$C$29","v":""},{"$f":"$D$29","v":""},{"$f":"$E$29","v":""},{"$f":"$F$29","v":""},{"$f":"$G$29","v":""},{"$f":"$H$29","v":""},{"$f":"$I$29","v":""},{"$f":"$J$29","v":""},{"$f":"$K$29","v":""},{"$f":"$L$29","v":""},{"$f":"$M$29","v":""}]
[null,{"$f":"IF(จัดตารางสอน!B27=\"\",\"\",จัดตารางสอน!B27)","v":""},{"$f":"IF(จัดตารางสอน!C27=\"\",\"\",จัดตารางสอน!C27)","v":""},{"$f":"IF(จัดตารางสอน!D27=\"\",\"\",จัดตารางสอน!D27)","v":""},{"$f":"IF(จัดตารางสอน!E27=\"\",\"\",จัดตารางสอน!E27)","v":""},{"$f":"IF(จัดตารางสอน!F27=\"\",\"\",จัดตารางสอน!F27)","v":""},{"$f":"IF(จัดตารางสอน!G27=\"\",\"\",จัดตารางสอน!G27)","v":""},{"$f":"IF(จัดตารางสอน!H27=\"\",\"\",จัดตารางสอน!H27)","v":""},{"$f":"IF(จัดตารางสอน!I27=\"\",\"\",จัดตารางสอน!I27)","v":""},{"$f":"IF(จัดตารางสอน!J27=\"\",\"\",จัดตารางสอน!J27)","v":""},{"$f":"IF(จัดตารางสอน!K27=\"\",\"\",จัดตารางสอน!K27)","v":""},{"$f":"IF(จัดตารางสอน!L27=\"\",\"\",จัดตารางสอน!L27)","v":""},{"$f":"IF(จัดตารางสอน!M27=\"\",\"\",จัดตารางสอน!M27)","v":""},null,null,{"$f":"$B$30","v":""},{"$f":"$C$30","v":""},{"$f":"$D$30","v":""},{"$f":"$E$30","v":""},{"$f":"$F$30","v":""},{"$f":"$G$30","v":""},{"$f":"$H$30","v":""},{"$f":"$I$30","v":""},{"$f":"$J$30","v":""},{"$f":"$K$30","v":""},{"$f":"$L$30","v":""},{"$f":"$M$30","v":""}]
[]
[{"$f":"$A$4","v":"โรงเรียนบ้านน้ำสอด สำนักงานเขตพื้นที่การศึกษาประถมศึกษาน่าน เขต 2"},null,null,null,null,null,null,null,null,null,null,null,null,null,{"$f":"$A$4","v":"โรงเรียนบ้านน้ำสอด สำนักงานเขตพื้นที่การศึกษาประถมศึกษาน่าน เขต 2"}]
[{"$f":"$A$5","v":"ตารางเรียน ประถมศึกษาปีที่ 1/1  ภาคเรียนที่ 2 ปีการศึกษา 2559"},null,null,null,null,null,null,null,null,null,null,null,null,null,{"$f":"$A$5","v":"ตารางเรียน ประถมศึกษาปีที่ 1/1  ภาคเรียนที่ 2 ปีการศึกษา 2559"}]
[]
[{"$f":"$A$7","v":"วัน"},{"$f":"$B$7","v":"ชั่วโมงที่"},null,null,null,null,null,null,null,null,null,null,null,null,{"$f":"$A$7","v":"วัน"},{"$f":"$B$7","v":"ชั่วโมงที่"},null,null,null,null,null,null,null,null,null,null,null,"ปรับขนาดตาราง"]
[null,1,2,3,4,5,6,7,8,9,10,11,12,null,null,1,2,3,4,5,6,7,8,9,10,11,12]
[{"$f":"$A$9","v":"เวลา"},{"$f":"$B$9","v":"8.00-8.30"},{"$f":"$C$9","v":"8.31-9.30"},{"$f":"$D$9","v":"9.31-10.30"},{"$f":"$E$9","v":"10.31-11.30"},{"$f":"$F$9","v":"11.31-12.30"},{"$f":"$G$9","v":"12.31-13.30"},{"$f":"$H$9","v":"13.31-14.30"},{"$f":"$I$9","v":"14.31-15.30"},{"$f":"$J$9","v":"-"},{"$f":"$K$9","v":"-"},{"$f":"$L$9","v":"-"},{"$f":"$M$9","v":"-"},null,{"$f":"$A$9","v":"เวลา"},{"$f":"$B$9","v":"8.00-8.30"},{"$f":"$C$9","v":"8.31-9.30"},{"$f":"$D$9","v":"9.31-10.30"},{"$f":"$E$9","v":"10.31-11.30"},{"$f":"$F$9","v":"11.31-12.30"},{"$f":"$G$9","v":"12.31-13.30"},{"$f":"$H$9","v":"13.31-14.30"},{"$f":"$I$9","v":"14.31-15.30"},{"$f":"$J$9","v":"-"},{"$f":"$K$9","v":"-"},{"$f":"$L$9","v":"-"},{"$f":"$M$9","v":"-"}]
[{"$f":"$A$10","v":"จันทร์"},{"$f":"$B$10","v":"A001"},{"$f":"$C$10","v":"คณิต1"},{"$f":"$D$10","v":"ไทย1"},{"$f":"$E$10","v":"ดนตรี1"},{"$f":"$F$10","v":"A003"},{"$f":"$G$10","v":"กอท1"},{"$f":"$H$10","v":"ศัพท์แสนสนุก1"},{"$f":"$I$10","v":"ก11905"},{"$f":"$J$10","v":""},{"$f":"$K$10","v":""},{"$f":"$L$10","v":""},{"$f":"$M$10","v":""},null,{"$f":"$A$10","v":"จันทร์"},{"$f":"$B$10","v":"A001"},{"$f":"$C$10","v":"คณิต1"},{"$f":"$D$10","v":"ไทย1"},{"$f":"$E$10","v":"ดนตรี1"},{"$f":"$F$10","v":"A003"},{"$f":"$G$10","v":"กอท1"},{"$f":"$H$10","v":"ศัพท์แสนสนุก1"},{"$f":"$I$10","v":"ก11905"},{"$f":"$J$10","v":""},{"$f":"$K$10","v":""},{"$f":"$L$10","v":""},{"$f":"$M$10","v":""},"จำนวนคาบ/ชั่วโมง ",null,8]
[null,{"$f":"$B$11","v":"หน้าเสาธง"},{"$f":"$C$11","v":"ครูนลินี"},{"$f":"$D$11","v":"ครูนลินี"},{"$f":"$E$11","v":"ครูนลินี"},{"$f":"$F$11","v":"พักกลางวัน"},{"$f":"$G$11","v":"ครูนลินี"},{"$f":"$H$11","v":"ครูรุ่งทิวา"},{"$f":"$I$11","v":"ICT1"},{"$f":"$J$11","v":""},{"$f":"$K$11","v":""},{"$f":"$L$11","v":""},{"$f":"$M$11","v":""},null,null,{"$f":"$B$11","v":"หน้าเสาธง"},{"$f":"$C$11","v":"ครูนลินี"},{"$f":"$D$11","v":"ครูนลินี"},{"$f":"$E$11","v":"ครูนลินี"},{"$f":"$F$11","v":"พักกลางวัน"},{"$f":"$G$11","v":"ครูนลินี"},{"$f":"$H$11","v":"ครูรุ่งทิวา"},{"$f":"$I$11","v":"ICT1"},{"$f":"$J$11","v":""},{"$f":"$K$11","v":""},{"$f":"$L$11","v":""},{"$f":"$M$11","v":""}]
[null,{"$f":"$B$12","v":"สนามโรงเรียน"},{"$f":"$C$12","v":"ห้อง ป.1/1"},{"$f":"$D$12","v":"ห้อง ป.1/1"},{"$f":"$E$12","v":"ห้อง ป.1/1"},{"$f":"$F$12","v":"โรงอาหาร"},{"$f":"$G$12","v":"ห้อง ป.1/1"},{"$f":"$H$12","v":"Soundlab"},{"$f":"$I$12","v":"ห้องคอมฯ"},{"$f":"$J$12","v":""},{"$f":"$K$12","v":""},{"$f":"$L$12","v":""},{"$f":"$M$12","v":""},null,null,{"$f":"$B$12","v":"สนามโรงเรียน"},{"$f":"$C$12","v":"ห้อง ป.1/1"},{"$f":"$D$12","v":"ห้อง ป.1/1"},{"$f":"$E$12","v":"ห้อง ป.1/1"},{"$f":"$F$12","v":"โรงอาหาร"},{"$f":"$G$12","v":"ห้อง ป.1/1"},{"$f":"$H$12","v":"Soundlab"},{"$f":"$I$12","v":"ห้องคอมฯ"},{"$f":"$J$12","v":""},{"$f":"$K$12","v":""},{"$f":"$L$12","v":""},{"$f":"$M$12","v":""}]
[{"$f":"$A$13","v":"อังคาร"},{"$f":"$B$13","v":"A001"},{"$f":"$C$13","v":"ไทย1"},{"$f":"$D$13","v":"คณิต1"},{"$f":"$E$13","v":"ประวัติ1"},{"$f":"$F$13","v":"A003"},{"$f":"$G$13","v":"ศิลปะ1"},{"$f":"$H$13","v":"ก11901"},{"$f":"$I$13","v":"ก11906"},{"$f":"$J$13","v":""},{"$f":"$K$13","v":""},{"$f":"$L$13","v":""},{"$f":"$M$13","v":""},null,{"$f":"$A$13","v":"อังคาร"},{"$f":"$B$13","v":"A001"},{"$f":"$C$13","v":"ไทย1"},{"$f":"$D$13","v":"คณิต1"},{"$f":"$E$13","v":"ประวัติ1"},{"$f":"$F$13","v":"A003"},{"$f":"$G$13","v":"ศิลปะ1"},{"$f":"$H$13","v":"ก11901"},{"$f":"$I$13","v":"ก11906"},{"$f":"$J$13","v":""},{"$f":"$K$13","v":""},{"$f":"$L$13","v":""},{"$f":"$M$13","v":""}]
[null,{"$f":"$B$14","v":"หน้าเสาธง"},{"$f":"$C$14","v":"ครูนลินี"},{"$f":"$D$14","v":"ครูนลินี"},{"$f":"$E$14","v":"ครูนลินี"},{"$f":"$F$14","v":"พักกลางวัน"},{"$f":"$G$14","v":"ครูนลินี"},{"$f":"$H$14","v":"แนะแนว1"},{"$f":"$I$14","v":"ลดเวลาเรียน"},{"$f":"$J$14","v":""},{"$f":"$K$14","v":""},{"$f":"$L$14","v":""},{"$f":"$M$14","v":""},null,null,{"$f":"$B$14","v":"หน้าเสาธง"},{"$f":"$C$14","v":"ครูนลินี"},{"$f":"$D$14","v":"ครูนลินี"},{"$f":"$E$14","v":"ครูนลินี"},{"$f":"$F$14","v":"พักกลางวัน"},{"$f":"$G$14","v":"ครูนลินี"},{"$f":"$H$14","v":"แนะแนว1"},{"$f":"$I$14","v":"ลดเวลาเรียน"},{"$f":"$J$14","v":""},{"$f":"$K$14","v":""},{"$f":"$L$14","v":""},{"$f":"$M$14","v":""}]
[null,{"$f":"$B$15","v":"สนามโรงเรียน"},{"$f":"$C$15","v":"ห้อง ป.1/1"},{"$f":"$D$15","v":"ห้อง ป.1/1"},{"$f":"$E$15","v":"ห้อง ป.1/1"},{"$f":"$F$15","v":"โรงอาหาร"},{"$f":"$G$15","v":"ห้อง ป.1/1"},{"$f":"$H$15","v":"ห้อง ป.1/1"},{"$f":"$I$15","v":"ห้อง ป.1/1"},{"$f":"$J$15","v":""},{"$f":"$K$15","v":""},{"$f":"$L$15","v":""},{"$f":"$M$15","v":""},null,null,{"$f":"$B$15","v":"สนามโรงเรียน"},{"$f":"$C$15","v":"ห้อง ป.1/1"},{"$f":"$D$15","v":"ห้อง ป.1/1"},{"$f":"$E$15","v":"ห้อง ป.1/1"},{"$f":"$F$15","v":"โรงอาหาร"},{"$f":"$G$15","v":"ห้อง ป.1/1"},{"$f":"$H$15","v":"ห้อง ป.1/1"},{"$f":"$I$15","v":"ห้อง ป.1/1"},{"$f":"$J$15","v":""},{"$f":"$K$15","v":""},{"$f":"$L$15","v":""},{"$f":"$M$15","v":""}]
[{"$f":"$A$16","v":"พุธ"},{"$f":"$B$16","v":"A001"},{"$f":"$C$16","v":"ไทย1"},{"$f":"$D$16","v":"สังคม1"},{"$f":"$E$16","v":"คณิต1"},{"$f":"$F$16","v":"A003"},{"$f":"$G$16","v":"สุขะ1"},{"$f":"$H$16","v":"ก11902"},{"$f":"$I$16","v":"ก11906"},{"$f":"$J$16","v":""},{"$f":"$K$16","v":""},{"$f":"$L$16","v":""},{"$f":"$M$16","v":""},null,{"$f":"$A$16","v":"พุธ"},{"$f":"$B$16","v":"A001"},{"$f":"$C$16","v":"ไทย1"},{"$f":"$D$16","v":"สังคม1"},{"$f":"$E$16","v":"คณิต1"},{"$f":"$F$16","v":"A003"},{"$f":"$G$16","v":"สุขะ1"},{"$f":"$H$16","v":"ก11902"},{"$f":"$I$16","v":"ก11906"},{"$f":"$J$16","v":""},{"$f":"$K$16","v":""},{"$f":"$L$16","v":""},{"$f":"$M$16","v":""}]
[null,{"$f":"$B$17","v":"หน้าเสาธง"},{"$f":"$C$17","v":"ครูนลินี"},{"$f":"$D$17","v":"ครูนลินี"},{"$f":"$E$17","v":"ครูนลินี"},{"$f":"$F$17","v":"พักกลางวัน"},{"$f":"$G$17","v":"ครูนลินี"},{"$f":"$H$17","v":"ลูกเสือ1"},{"$f":"$I$17","v":"ลดเวลาเรียน"},{"$f":"$J$17","v":""},{"$f":"$K$17","v":""},{"$f":"$L$17","v":""},{"$f":"$M$17","v":""},null,null,{"$f":"$B$17","v":"หน้าเสาธง"},{"$f":"$C$17","v":"ครูนลินี"},{"$f":"$D$17","v":"ครูนลินี"},{"$f":"$E$17","v":"ครูนลินี"},{"$f":"$F$17","v":"พักกลางวัน"},{"$f":"$G$17","v":"ครูนลินี"},{"$f":"$H$17","v":"ลูกเสือ1"},{"$f":"$I$17","v":"ลดเวลาเรียน"},{"$f":"$J$17","v":""},{"$f":"$K$17","v":""},{"$f":"$L$17","v":""},{"$f":"$M$17","v":""}]
[null,{"$f":"$B$18","v":"สนามโรงเรียน"},{"$f":"$C$18","v":"ห้อง ป.1/1"},{"$f":"$D$18","v":"ห้อง ป.1/1"},{"$f":"$E$18","v":"ห้อง ป.1/1"},{"$f":"$F$18","v":"โรงอาหาร"},{"$f":"$G$18","v":"ห้อง ป.1/1"},{"$f":"$H$18","v":"ห้อง ป.1/1"},{"$f":"$I$18","v":"ห้อง ป.1/1"},{"$f":"$J$18","v":""},{"$f":"$K$18","v":""},{"$f":"$L$18","v":""},{"$f":"$M$18","v":""},null,null,{"$f":"$B$18","v":"สนามโรงเรียน"},{"$f":"$C$18","v":"ห้อง ป.1/1"},{"$f":"$D$18","v":"ห้อง ป.1/1"},{"$f":"$E$18","v":"ห้อง ป.1/1"},{"$f":"$F$18","v":"โรงอาหาร"},{"$f":"$G$18","v":"ห้อง ป.1/1"},{"$f":"$H$18","v":"ห้อง ป.1/1"},{"$f":"$I$18","v":"ห้อง ป.1/1"},{"$f":"$J$18","v":""},{"$f":"$K$18","v":""},{"$f":"$L$18","v":""},{"$f":"$M$18","v":""}]
[{"$f":"$A$19","v":"พฤหัสบดี"},{"$f":"$B$19","v":"A001"},{"$f":"$C$19","v":"อังกฤษ1"},{"$f":"$D$19","v":"คณิต1"},{"$f":"$E$19","v":"ไทย1"},{"$f":"$F$19","v":"A003"},{"$f":"$G$19","v":"วิทย์1"},{"$f":"$H$19","v":"พละ1"},{"$f":"$I$19","v":"ก11906"},{"$f":"$J$19","v":""},{"$f":"$K$19","v":""},{"$f":"$L$19","v":""},{"$f":"$M$19","v":""},null,{"$f":"$A$19","v":"พฤหัสบดี"},{"$f":"$B$19","v":"A001"},{"$f":"$C$19","v":"อังกฤษ1"},{"$f":"$D$19","v":"คณิต1"},{"$f":"$E$19","v":"ไทย1"},{"$f":"$F$19","v":"A003"},{"$f":"$G$19","v":"วิทย์1"},{"$f":"$H$19","v":"พละ1"},{"$f":"$I$19","v":"ก11906"},{"$f":"$J$19","v":""},{"$f":"$K$19","v":""},{"$f":"$L$19","v":""},{"$f":"$M$19","v":""}]
[null,{"$f":"$B$20","v":"หน้าเสาธง"},{"$f":"$C$20","v":"ครูรุ่งทิวา"},{"$f":"$D$20","v":"ครูนลินี"},{"$f":"$E$20","v":"ครูนลินี"},{"$f":"$F$20","v":"พักกลางวัน"},{"$f":"$G$20","v":"ครูภิญญาภรณ์"},{"$f":"$H$20","v":"ครูนลินี"},{"$f":"$I$20","v":"ลดเวลาเรียน"},{"$f":"$J$20","v":""},{"$f":"$K$20","v":""},{"$f":"$L$20","v":""},{"$f":"$M$20","v":""},null,null,{"$f":"$B$20","v":"หน้าเสาธง"},{"$f":"$C$20","v":"ครูรุ่งทิวา"},{"$f":"$D$20","v":"ครูนลินี"},{"$f":"$E$20","v":"ครูนลินี"},{"$f":"$F$20","v":"พักกลางวัน"},{"$f":"$G$20","v":"ครูภิญญาภรณ์"},{"$f":"$H$20","v":"ครูนลินี"},{"$f":"$I$20","v":"ลดเวลาเรียน"},{"$f":"$J$20","v":""},{"$f":"$K$20","v":""},{"$f":"$L$20","v":""},{"$f":"$M$20","v":""}]
[null,{"$f":"$B$21","v":"สนามโรงเรียน"},{"$f":"$C$21","v":"Soundlab"},{"$f":"$D$21","v":"ห้อง ป.1/1"},{"$f":"$E$21","v":"ห้อง ป.1/1"},{"$f":"$F$21","v":"โรงอาหาร"},{"$f":"$G$21","v":"ห้องวิทย์"},{"$f":"$H$21","v":"ห้อง ป.1/1"},{"$f":"$I$21","v":"ห้อง ป.1/1"},{"$f":"$J$21","v":""},{"$f":"$K$21","v":""},{"$f":"$L$21","v":""},{"$f":"$M$21","v":""},null,null,{"$f":"$B$21","v":"สนามโรงเรียน"},{"$f":"$C$21","v":"Soundlab"},{"$f":"$D$21","v":"ห้อง ป.1/1"},{"$f":"$E$21","v":"ห้อง ป.1/1"},{"$f":"$F$21","v":"โรงอาหาร"},{"$f":"$G$21","v":"ห้องวิทย์"},{"$f":"$H$21","v":"ห้อง ป.1/1"},{"$f":"$I$21","v":"ห้อง ป.1/1"},{"$f":"$J$21","v":""},{"$f":"$K$21","v":""},{"$f":"$L$21","v":""},{"$f":"$M$21","v":""}]
[{"$f":"$A$22","v":"ศุกร์"},{"$f":"$B$22","v":"A001"},{"$f":"$C$22","v":"คณิต1"},{"$f":"$D$22","v":"ไทย1"},{"$f":"$E$22","v":"วิทย์1"},{"$f":"$F$22","v":"A003"},{"$f":"$G$22","v":"สังคม1"},{"$f":"$H$22","v":"ก11903"},{"$f":"$I$22","v":"ก11906"},{"$f":"$J$22","v":""},{"$f":"$K$22","v":""},{"$f":"$L$22","v":""},{"$f":"$M$22","v":""},null,{"$f":"$A$22","v":"ศุกร์"},{"$f":"$B$22","v":"A001"},{"$f":"$C$22","v":"คณิต1"},{"$f":"$D$22","v":"ไทย1"},{"$f":"$E$22","v":"วิทย์1"},{"$f":"$F$22","v":"A003"},{"$f":"$G$22","v":"สังคม1"},{"$f":"$H$22","v":"ก11903"},{"$f":"$I$22","v":"ก11906"},{"$f":"$J$22","v":""},{"$f":"$K$22","v":""},{"$f":"$L$22","v":""},{"$f":"$M$22","v":""}]
[null,{"$f":"$B$23","v":"หน้าเสาธง"},{"$f":"$C$23","v":"ครูนลินี"},{"$f":"$D$23","v":"ครูนลินี"},{"$f":"$E$23","v":"ครูภิญญาภรณ์"},{"$f":"$F$23","v":"พักกลางวัน"},{"$f":"$G$23","v":"ครูนลินี"},{"$f":"$H$23","v":"ชุมนุม1"},{"$f":"$I$23","v":"ลดเวลาเรียน"},{"$f":"$J$23","v":""},{"$f":"$K$23","v":""},{"$f":"$L$23","v":""},{"$f":"$M$23","v":""},null,null,{"$f":"$B$23","v":"หน้าเสาธง"},{"$f":"$C$23","v":"ครูนลินี"},{"$f":"$D$23","v":"ครูนลินี"},{"$f":"$E$23","v":"ครูภิญญาภรณ์"},{"$f":"$F$23","v":"พักกลางวัน"},{"$f":"$G$23","v":"ครูนลินี"},{"$f":"$H$23","v":"ชุมนุม1"},{"$f":"$I$23","v":"ลดเวลาเรียน"},{"$f":"$J$23","v":""},{"$f":"$K$23","v":""},{"$f":"$L$23","v":""},{"$f":"$M$23","v":""}]
[null,{"$f":"$B$24","v":"สนามโรงเรียน"},{"$f":"$C$24","v":"ห้อง ป.1/1"},{"$f":"$D$24","v":"ห้อง ป.1/1"},{"$f":"$E$24","v":"ห้องวิทย์"},{"$f":"$F$24","v":"โรงอาหาร"},{"$f":"$G$24","v":"ห้อง ป.1/1"},{"$f":"$H$24","v":"ห้อง ป.1/1"},{"$f":"$I$24","v":"ห้อง ป.1/1"},{"$f":"$J$24","v":""},{"$f":"$K$24","v":""},{"$f":"$L$24","v":""},{"$f":"$M$24","v":""},null,null,{"$f":"$B$24","v":"สนามโรงเรียน"},{"$f":"$C$24","v":"ห้อง ป.1/1"},{"$f":"$D$24","v":"ห้อง ป.1/1"},{"$f":"$E$24","v":"ห้องวิทย์"},{"$f":"$F$24","v":"โรงอาหาร"},{"$f":"$G$24","v":"ห้อง ป.1/1"},{"$f":"$H$24","v":"ห้อง ป.1/1"},{"$f":"$I$24","v":"ห้อง ป.1/1"},{"$f":"$J$24","v":""},{"$f":"$K$24","v":""},{"$f":"$L$24","v":""},{"$f":"$M$24","v":""}]
[{"$f":"$A$25","v":"เสาร์"},{"$f":"$B$25","v":""},{"$f":"$C$25","v":""},{"$f":"$D$25","v":""},{"$f":"$E$25","v":""},{"$f":"$F$25","v":""},{"$f":"$G$25","v":""},{"$f":"$H$25","v":""},{"$f":"$I$25","v":""},{"$f":"$J$25","v":""},{"$f":"$K$25","v":""},{"$f":"$L$25","v":""},{"$f":"$M$25","v":""},null,{"$f":"$A$25","v":"เสาร์"},{"$f":"$B$25","v":""},{"$f":"$C$25","v":""},{"$f":"$D$25","v":""},{"$f":"$E$25","v":""},{"$f":"$F$25","v":""},{"$f":"$G$25","v":""},{"$f":"$H$25","v":""},{"$f":"$I$25","v":""},{"$f":"$J$25","v":""},{"$f":"$K$25","v":""},{"$f":"$L$25","v":""},{"$f":"$M$25","v":""}]
[null,{"$f":"$B$26","v":""},{"$f":"$C$26","v":""},{"$f":"$D$26","v":""},{"$f":"$E$26","v":""},{"$f":"$F$26","v":""},{"$f":"$G$26","v":""},{"$f":"$H$26","v":""},{"$f":"$I$26","v":""},{"$f":"$J$26","v":""},{"$f":"$K$26","v":""},{"$f":"$L$26","v":""},{"$f":"$M$26","v":""},null,null,{"$f":"$B$26","v":""},{"$f":"$C$26","v":""},{"$f":"$D$26","v":""},{"$f":"$E$26","v":""},{"$f":"$F$26","v":""},{"$f":"$G$26","v":""},{"$f":"$H$26","v":""},{"$f":"$I$26","v":""},{"$f":"$J$26","v":""},{"$f":"$K$26","v":""},{"$f":"$L$26","v":""},{"$f":"$M$26","v":""}]
[null,{"$f":"$B$27","v":""},{"$f":"$C$27","v":""},{"$f":"$D$27","v":""},{"$f":"$E$27","v":""},{"$f":"$F$27","v":""},{"$f":"$G$27","v":""},{"$f":"$H$27","v":""},{"$f":"$I$27","v":""},{"$f":"$J$27","v":""},{"$f":"$K$27","v":""},{"$f":"$L$27","v":""},{"$f":"$M$27","v":""},null,null,{"$f":"$B$27","v":""},{"$f":"$C$27","v":""},{"$f":"$D$27","v":""},{"$f":"$E$27","v":""},{"$f":"$F$27","v":""},{"$f":"$G$27","v":""},{"$f":"$H$27","v":""},{"$f":"$I$27","v":""},{"$f":"$J$27","v":""},{"$f":"$K$27","v":""},{"$f":"$L$27","v":""},{"$f":"$M$27","v":""}]
[{"$f":"$A$28","v":"อาทิตย์"},{"$f":"$B$28","v":""},{"$f":"$C$28","v":""},{"$f":"$D$28","v":""},{"$f":"$E$28","v":""},{"$f":"$F$28","v":""},{"$f":"$G$28","v":""},{"$f":"$H$28","v":""},{"$f":"$I$28","v":""},{"$f":"$J$28","v":""},{"$f":"$K$28","v":""},{"$f":"$L$28","v":""},{"$f":"$M$28","v":""},null,{"$f":"$A$28","v":"อาทิตย์"},{"$f":"$B$28","v":""},{"$f":"$C$28","v":""},{"$f":"$D$28","v":""},{"$f":"$E$28","v":""},{"$f":"$F$28","v":""},{"$f":"$G$28","v":""},{"$f":"$H$28","v":""},{"$f":"$I$28","v":""},{"$f":"$J$28","v":""},{"$f":"$K$28","v":""},{"$f":"$L$28","v":""},{"$f":"$M$28","v":""}]
[null,{"$f":"$B$29","v":""},{"$f":"$C$29","v":""},{"$f":"$D$29","v":""},{"$f":"$E$29","v":""},{"$f":"$F$29","v":""},{"$f":"$G$29","v":""},{"$f":"$H$29","v":""},{"$f":"$I$29","v":""},{"$f":"$J$29","v":""},{"$f":"$K$29","v":""},{"$f":"$L$29","v":""},{"$f":"$M$29","v":""},null,null,{"$f":"$B$29","v":""},{"$f":"$C$29","v":""},{"$f":"$D$29","v":""},{"$f":"$E$29","v":""},{"$f":"$F$29","v":""},{"$f":"$G$29","v":""},{"$f":"$H$29","v":""},{"$f":"$I$29","v":""},{"$f":"$J$29","v":""},{"$f":"$K$29","v":""},{"$f":"$L$29","v":""},{"$f":"$M$29","v":""}]
[null,{"$f":"$B$30","v":""},{"$f":"$C$30","v":""},{"$f":"$D$30","v":""},{"$f":"$E$30","v":""},{"$f":"$F$30","v":""},{"$f":"$G$30","v":""},{"$f":"$H$30","v":""},{"$f":"$I$30","v":""},{"$f":"$J$30","v":""},{"$f":"$K$30","v":""},{"$f":"$L$30","v":""},{"$f":"$M$30","v":""},null,null,{"$f":"$B$30","v":""},{"$f":"$C$30","v":""},{"$f":"$D$30","v":""},{"$f":"$E$30","v":""},{"$f":"$F$30","v":""},{"$f":"$G$30","v":""},{"$f":"$H$30","v":""},{"$f":"$I$30","v":""},{"$f":"$J$30","v":""},{"$f":"$K$30","v":""},{"$f":"$L$30","v":""},{"$f":"$M$30","v":""}]
[]
[{"$f":"$A$4","v":"โรงเรียนบ้านน้ำสอด สำนักงานเขตพื้นที่การศึกษาประถมศึกษาน่าน เขต 2"},null,null,null,null,null,null,null,null,null,null,null,null,null,{"$f":"$A$4","v":"โรงเรียนบ้านน้ำสอด สำนักงานเขตพื้นที่การศึกษาประถมศึกษาน่าน เขต 2"}]
[{"$f":"$A$5","v":"ตารางเรียน ประถมศึกษาปีที่ 1/1  ภาคเรียนที่ 2 ปีการศึกษา 2559"},null,null,null,null,null,null,null,null,null,null,null,null,null,{"$f":"$A$5","v":"ตารางเรียน ประถมศึกษาปีที่ 1/1  ภาคเรียนที่ 2 ปีการศึกษา 2559"}]
[]
[{"$f":"$A$7","v":"วัน"},{"$f":"$B$7","v":"ชั่วโมงที่"},null,null,null,null,null,null,null,null,null,null,null,null,{"$f":"$A$7","v":"วัน"},{"$f":"$B$7","v":"ชั่วโมงที่"}]
[null,1,2,3,4,5,6,7,8,9,10,11,12,null,null,1,2,3,4,5,6,7,8,9,10,11,12]
[{"$f":"$A$9","v":"เวลา"},{"$f":"$B$9","v":"8.00-8.30"},{"$f":"$C$9","v":"8.31-9.30"},{"$f":"$D$9","v":"9.31-10.30"},{"$f":"$E$9","v":"10.31-11.30"},{"$f":"$F$9","v":"11.31-12.30"},{"$f":"$G$9","v":"12.31-13.30"},{"$f":"$H$9","v":"13.31-14.30"},{"$f":"$I$9","v":"14.31-15.30"},{"$f":"$J$9","v":"-"},{"$f":"$K$9","v":"-"},{"$f":"$L$9","v":"-"},{"$f":"$M$9","v":"-"},null,{"$f":"$A$9","v":"เวลา"},{"$f":"$B$9","v":"8.00-8.30"},{"$f":"$C$9","v":"8.31-9.30"},{"$f":"$D$9","v":"9.31-10.30"},{"$f":"$E$9","v":"10.31-11.30"},{"$f":"$F$9","v":"11.31-12.30"},{"$f":"$G$9","v":"12.31-13.30"},{"$f":"$H$9","v":"13.31-14.30"},{"$f":"$I$9","v":"14.31-15.30"},{"$f":"$J$9","v":"-"},{"$f":"$K$9","v":"-"},{"$f":"$L$9","v":"-"},{"$f":"$M$9","v":"-"}]
[{"$f":"$A$10","v":"จันทร์"},{"$f":"$B$10","v":"A001"},{"$f":"$C$10","v":"คณิต1"},{"$f":"$D$10","v":"ไทย1"},{"$f":"$E$10","v":"ดนตรี1"},{"$f":"$F$10","v":"A003"},{"$f":"$G$10","v":"กอท1"},{"$f":"$H$10","v":"ศัพท์แสนสนุก1"},{"$f":"$I$10","v":"ก11905"},{"$f":"$J$10","v":""},{"$f":"$K$10","v":""},{"$f":"$L$10","v":""},{"$f":"$M$10","v":""},null,{"$f":"$A$10","v":"จันทร์"},{"$f":"$B$10","v":"A001"},{"$f":"$C$10","v":"คณิต1"},{"$f":"$D$10","v":"ไทย1"},{"$f":"$E$10","v":"ดนตรี1"},{"$f":"$F$10","v":"A003"},{"$f":"$G$10","v":"กอท1"},{"$f":"$H$10","v":"ศัพท์แสนสนุก1"},{"$f":"$I$10","v":"ก11905"},{"$f":"$J$10","v":""},{"$f":"$K$10","v":""},{"$f":"$L$10","v":""},{"$f":"$M$10","v":""}]
[null,{"$f":"$B$11","v":"หน้าเสาธง"},{"$f":"$C$11","v":"ครูนลินี"},{"$f":"$D$11","v":"ครูนลินี"},{"$f":"$E$11","v":"ครูนลินี"},{"$f":"$F$11","v":"พักกลางวัน"},{"$f":"$G$11","v":"ครูนลินี"},{"$f":"$H$11","v":"ครูรุ่งทิวา"},{"$f":"$I$11","v":"ICT1"},{"$f":"$J$11","v":""},{"$f":"$K$11","v":""},{"$f":"$L$11","v":""},{"$f":"$M$11","v":""},null,null,{"$f":"$B$11","v":"หน้าเสาธง"},{"$f":"$C$11","v":"ครูนลินี"},{"$f":"$D$11","v":"ครูนลินี"},{"$f":"$E$11","v":"ครูนลินี"},{"$f":"$F$11","v":"พักกลางวัน"},{"$f":"$G$11","v":"ครูนลินี"},{"$f":"$H$11","v":"ครูรุ่งทิวา"},{"$f":"$I$11","v":"ICT1"},{"$f":"$J$11","v":""},{"$f":"$K$11","v":""},{"$f":"$L$11","v":""},{"$f":"$M$11","v":""}]
[null,{"$f":"$B$12","v":"สนามโรงเรียน"},{"$f":"$C$12","v":"ห้อง ป.1/1"},{"$f":"$D$12","v":"ห้อง ป.1/1"},{"$f":"$E$12","v":"ห้อง ป.1/1"},{"$f":"$F$12","v":"โรงอาหาร"},{"$f":"$G$12","v":"ห้อง ป.1/1"},{"$f":"$H$12","v":"Soundlab"},{"$f":"$I$12","v":"ห้องคอมฯ"},{"$f":"$J$12","v":""},{"$f":"$K$12","v":""},{"$f":"$L$12","v":""},{"$f":"$M$12","v":""},null,null,{"$f":"$B$12","v":"สนามโรงเรียน"},{"$f":"$C$12","v":"ห้อง ป.1/1"},{"$f":"$D$12","v":"ห้อง ป.1/1"},{"$f":"$E$12","v":"ห้อง ป.1/1"},{"$f":"$F$12","v":"โรงอาหาร"},{"$f":"$G$12","v":"ห้อง ป.1/1"},{"$f":"$H$12","v":"Soundlab"},{"$f":"$I$12","v":"ห้องคอมฯ"},{"$f":"$J$12","v":""},{"$f":"$K$12","v":""},{"$f":"$L$12","v":""},{"$f":"$M$12","v":""}]
[{"$f":"$A$13","v":"อังคาร"},{"$f":"$B$13","v":"A001"},{"$f":"$C$13","v":"ไทย1"},{"$f":"$D$13","v":"คณิต1"},{"$f":"$E$13","v":"ประวัติ1"},{"$f":"$F$13","v":"A003"},{"$f":"$G$13","v":"ศิลปะ1"},{"$f":"$H$13","v":"ก11901"},{"$f":"$I$13","v":"ก11906"},{"$f":"$J$13","v":""},{"$f":"$K$13","v":""},{"$f":"$L$13","v":""},{"$f":"$M$13","v":""},null,{"$f":"$A$13","v":"อังคาร"},{"$f":"$B$13","v":"A001"},{"$f":"$C$13","v":"ไทย1"},{"$f":"$D$13","v":"คณิต1"},{"$f":"$E$13","v":"ประวัติ1"},{"$f":"$F$13","v":"A003"},{"$f":"$G$13","v":"ศิลปะ1"},{"$f":"$H$13","v":"ก11901"},{"$f":"$I$13","v":"ก11906"},{"$f":"$J$13","v":""},{"$f":"$K$13","v":""},{"$f":"$L$13","v":""},{"$f":"$M$13","v":""}]
[null,{"$f":"$B$14","v":"หน้าเสาธง"},{"$f":"$C$14","v":"ครูนลินี"},{"$f":"$D$14","v":"ครูนลินี"},{"$f":"$E$14","v":"ครูนลินี"},{"$f":"$F$14","v":"พักกลางวัน"},{"$f":"$G$14","v":"ครูนลินี"},{"$f":"$H$14","v":"แนะแนว1"},{"$f":"$I$14","v":"ลดเวลาเรียน"},{"$f":"$J$14","v":""},{"$f":"$K$14","v":""},{"$f":"$L$14","v":""},{"$f":"$M$14","v":""},null,null,{"$f":"$B$14","v":"หน้าเสาธง"},{"$f":"$C$14","v":"ครูนลินี"},{"$f":"$D$14","v":"ครูนลินี"},{"$f":"$E$14","v":"ครูนลินี"},{"$f":"$F$14","v":"พักกลางวัน"},{"$f":"$G$14","v":"ครูนลินี"},{"$f":"$H$14","v":"แนะแนว1"},{"$f":"$I$14","v":"ลดเวลาเรียน"},{"$f":"$J$14","v":""},{"$f":"$K$14","v":""},{"$f":"$L$14","v":""},{"$f":"$M$14","v":""}]
[null,{"$f":"$B$15","v":"สนามโรงเรียน"},{"$f":"$C$15","v":"ห้อง ป.1/1"},{"$f":"$D$15","v":"ห้อง ป.1/1"},{"$f":"$E$15","v":"ห้อง ป.1/1"},{"$f":"$F$15","v":"โรงอาหาร"},{"$f":"$G$15","v":"ห้อง ป.1/1"},{"$f":"$H$15","v":"ห้อง ป.1/1"},{"$f":"$I$15","v":"ห้อง ป.1/1"},{"$f":"$J$15","v":""},{"$f":"$K$15","v":""},{"$f":"$L$15","v":""},{"$f":"$M$15","v":""},null,null,{"$f":"$B$15","v":"สนามโรงเรียน"},{"$f":"$C$15","v":"ห้อง ป.1/1"},{"$f":"$D$15","v":"ห้อง ป.1/1"},{"$f":"$E$15","v":"ห้อง ป.1/1"},{"$f":"$F$15","v":"โรงอาหาร"},{"$f":"$G$15","v":"ห้อง ป.1/1"},{"$f":"$H$15","v":"ห้อง ป.1/1"},{"$f":"$I$15","v":"ห้อง ป.1/1"},{"$f":"$J$15","v":""},{"$f":"$K$15","v":""},{"$f":"$L$15","v":""},{"$f":"$M$15","v":""}]
[{"$f":"$A$16","v":"พุธ"},{"$f":"$B$16","v":"A001"},{"$f":"$C$16","v":"ไทย1"},{"$f":"$D$16","v":"สังคม1"},{"$f":"$E$16","v":"คณิต1"},{"$f":"$F$16","v":"A003"},{"$f":"$G$16","v":"สุขะ1"},{"$f":"$H$16","v":"ก11902"},{"$f":"$I$16","v":"ก11906"},{"$f":"$J$16","v":""},{"$f":"$K$16","v":""},{"$f":"$L$16","v":""},{"$f":"$M$16","v":""},null,{"$f":"$A$16","v":"พุธ"},{"$f":"$B$16","v":"A001"},{"$f":"$C$16","v":"ไทย1"},{"$f":"$D$16","v":"สังคม1"},{"$f":"$E$16","v":"คณิต1"},{"$f":"$F$16","v":"A003"},{"$f":"$G$16","v":"สุขะ1"},{"$f":"$H$16","v":"ก11902"},{"$f":"$I$16","v":"ก11906"},{"$f":"$J$16","v":""},{"$f":"$K$16","v":""},{"$f":"$L$16","v":""},{"$f":"$M$16","v":""}]
[null,{"$f":"$B$17","v":"หน้าเสาธง"},{"$f":"$C$17","v":"ครูนลินี"},{"$f":"$D$17","v":"ครูนลินี"},{"$f":"$E$17","v":"ครูนลินี"},{"$f":"$F$17","v":"พักกลางวัน"},{"$f":"$G$17","v":"ครูนลินี"},{"$f":"$H$17","v":"ลูกเสือ1"},{"$f":"$I$17","v":"ลดเวลาเรียน"},{"$f":"$J$17","v":""},{"$f":"$K$17","v":""},{"$f":"$L$17","v":""},{"$f":"$M$17","v":""},null,null,{"$f":"$B$17","v":"หน้าเสาธง"},{"$f":"$C$17","v":"ครูนลินี"},{"$f":"$D$17","v":"ครูนลินี"},{"$f":"$E$17","v":"ครูนลินี"},{"$f":"$F$17","v":"พักกลางวัน"},{"$f":"$G$17","v":"ครูนลินี"},{"$f":"$H$17","v":"ลูกเสือ1"},{"$f":"$I$17","v":"ลดเวลาเรียน"},{"$f":"$J$17","v":""},{"$f":"$K$17","v":""},{"$f":"$L$17","v":""},{"$f":"$M$17","v":""}]
[null,{"$f":"$B$18","v":"สนามโรงเรียน"},{"$f":"$C$18","v":"ห้อง ป.1/1"},{"$f":"$D$18","v":"ห้อง ป.1/1"},{"$f":"$E$18","v":"ห้อง ป.1/1"},{"$f":"$F$18","v":"โรงอาหาร"},{"$f":"$G$18","v":"ห้อง ป.1/1"},{"$f":"$H$18","v":"ห้อง ป.1/1"},{"$f":"$I$18","v":"ห้อง ป.1/1"},{"$f":"$J$18","v":""},{"$f":"$K$18","v":""},{"$f":"$L$18","v":""},{"$f":"$M$18","v":""},null,null,{"$f":"$B$18","v":"สนามโรงเรียน"},{"$f":"$C$18","v":"ห้อง ป.1/1"},{"$f":"$D$18","v":"ห้อง ป.1/1"},{"$f":"$E$18","v":"ห้อง ป.1/1"},{"$f":"$F$18","v":"โรงอาหาร"},{"$f":"$G$18","v":"ห้อง ป.1/1"},{"$f":"$H$18","v":"ห้อง ป.1/1"},{"$f":"$I$18","v":"ห้อง ป.1/1"},{"$f":"$J$18","v":""},{"$f":"$K$18","v":""},{"$f":"$L$18","v":""},{"$f":"$M$18","v":""}]
[{"$f":"$A$19","v":"พฤหัสบดี"},{"$f":"$B$19","v":"A001"},{"$f":"$C$19","v":"อังกฤษ1"},{"$f":"$D$19","v":"คณิต1"},{"$f":"$E$19","v":"ไทย1"},{"$f":"$F$19","v":"A003"},{"$f":"$G$19","v":"วิทย์1"},{"$f":"$H$19","v":"พละ1"},{"$f":"$I$19","v":"ก11906"},{"$f":"$J$19","v":""},{"$f":"$K$19","v":""},{"$f":"$L$19","v":""},{"$f":"$M$19","v":""},null,{"$f":"$A$19","v":"พฤหัสบดี"},{"$f":"$B$19","v":"A001"},{"$f":"$C$19","v":"อังกฤษ1"},{"$f":"$D$19","v":"คณิต1"},{"$f":"$E$19","v":"ไทย1"},{"$f":"$F$19","v":"A003"},{"$f":"$G$19","v":"วิทย์1"},{"$f":"$H$19","v":"พละ1"},{"$f":"$I$19","v":"ก11906"},{"$f":"$J$19","v":""},{"$f":"$K$19","v":""},{"$f":"$L$19","v":""},{"$f":"$M$19","v":""}]
[null,{"$f":"$B$20","v":"หน้าเสาธง"},{"$f":"$C$20","v":"ครูรุ่งทิวา"},{"$f":"$D$20","v":"ครูนลินี"},{"$f":"$E$20","v":"ครูนลินี"},{"$f":"$F$20","v":"พักกลางวัน"},{"$f":"$G$20","v":"ครูภิญญาภรณ์"},{"$f":"$H$20","v":"ครูนลินี"},{"$f":"$I$20","v":"ลดเวลาเรียน"},{"$f":"$J$20","v":""},{"$f":"$K$20","v":""},{"$f":"$L$20","v":""},{"$f":"$M$20","v":""},null,null,{"$f":"$B$20","v":"หน้าเสาธง"},{"$f":"$C$20","v":"ครูรุ่งทิวา"},{"$f":"$D$20","v":"ครูนลินี"},{"$f":"$E$20","v":"ครูนลินี"},{"$f":"$F$20","v":"พักกลางวัน"},{"$f":"$G$20","v":"ครูภิญญาภรณ์"},{"$f":"$H$20","v":"ครูนลินี"},{"$f":"$I$20","v":"ลดเวลาเรียน"},{"$f":"$J$20","v":""},{"$f":"$K$20","v":""},{"$f":"$L$20","v":""},{"$f":"$M$20","v":""}]
[null,{"$f":"$B$21","v":"สนามโรงเรียน"},{"$f":"$C$21","v":"Soundlab"},{"$f":"$D$21","v":"ห้อง ป.1/1"},{"$f":"$E$21","v":"ห้อง ป.1/1"},{"$f":"$F$21","v":"โรงอาหาร"},{"$f":"$G$21","v":"ห้องวิทย์"},{"$f":"$H$21","v":"ห้อง ป.1/1"},{"$f":"$I$21","v":"ห้อง ป.1/1"},{"$f":"$J$21","v":""},{"$f":"$K$21","v":""},{"$f":"$L$21","v":""},{"$f":"$M$21","v":""},null,null,{"$f":"$B$21","v":"สนามโรงเรียน"},{"$f":"$C$21","v":"Soundlab"},{"$f":"$D$21","v":"ห้อง ป.1/1"},{"$f":"$E$21","v":"ห้อง ป.1/1"},{"$f":"$F$21","v":"โรงอาหาร"},{"$f":"$G$21","v":"ห้องวิทย์"},{"$f":"$H$21","v":"ห้อง ป.1/1"},{"$f":"$I$21","v":"ห้อง ป.1/1"},{"$f":"$J$21","v":""},{"$f":"$K$21","v":""},{"$f":"$L$21","v":""},{"$f":"$M$21","v":""}]
[{"$f":"$A$22","v":"ศุกร์"},{"$f":"$B$22","v":"A001"},{"$f":"$C$22","v":"คณิต1"},{"$f":"$D$22","v":"ไทย1"},{"$f":"$E$22","v":"วิทย์1"},{"$f":"$F$22","v":"A003"},{"$f":"$G$22","v":"สังคม1"},{"$f":"$H$22","v":"ก11903"},{"$f":"$I$22","v":"ก11906"},{"$f":"$J$22","v":""},{"$f":"$K$22","v":""},{"$f":"$L$22","v":""},{"$f":"$M$22","v":""},null,{"$f":"$A$22","v":"ศุกร์"},{"$f":"$B$22","v":"A001"},{"$f":"$C$22","v":"คณิต1"},{"$f":"$D$22","v":"ไทย1"},{"$f":"$E$22","v":"วิทย์1"},{"$f":"$F$22","v":"A003"},{"$f":"$G$22","v":"สังคม1"},{"$f":"$H$22","v":"ก11903"},{"$f":"$I$22","v":"ก11906"},{"$f":"$J$22","v":""},{"$f":"$K$22","v":""},{"$f":"$L$22","v":""},{"$f":"$M$22","v":""}]
[null,{"$f":"$B$23","v":"หน้าเสาธง"},{"$f":"$C$23","v":"ครูนลินี"},{"$f":"$D$23","v":"ครูนลินี"},{"$f":"$E$23","v":"ครูภิญญาภรณ์"},{"$f":"$F$23","v":"พักกลางวัน"},{"$f":"$G$23","v":"ครูนลินี"},{"$f":"$H$23","v":"ชุมนุม1"},{"$f":"$I$23","v":"ลดเวลาเรียน"},{"$f":"$J$23","v":""},{"$f":"$K$23","v":""},{"$f":"$L$23","v":""},{"$f":"$M$23","v":""},null,null,{"$f":"$B$23","v":"หน้าเสาธง"},{"$f":"$C$23","v":"ครูนลินี"},{"$f":"$D$23","v":"ครูนลินี"},{"$f":"$E$23","v":"ครูภิญญาภรณ์"},{"$f":"$F$23","v":"พักกลางวัน"},{"$f":"$G$23","v":"ครูนลินี"},{"$f":"$H$23","v":"ชุมนุม1"},{"$f":"$I$23","v":"ลดเวลาเรียน"},{"$f":"$J$23","v":""},{"$f":"$K$23","v":""},{"$f":"$L$23","v":""},{"$f":"$M$23","v":""}]
[null,{"$f":"$B$24","v":"สนามโรงเรียน"},{"$f":"$C$24","v":"ห้อง ป.1/1"},{"$f":"$D$24","v":"ห้อง ป.1/1"},{"$f":"$E$24","v":"ห้องวิทย์"},{"$f":"$F$24","v":"โรงอาหาร"},{"$f":"$G$24","v":"ห้อง ป.1/1"},{"$f":"$H$24","v":"ห้อง ป.1/1"},{"$f":"$I$24","v":"ห้อง ป.1/1"},{"$f":"$J$24","v":""},{"$f":"$K$24","v":""},{"$f":"$L$24","v":""},{"$f":"$M$24","v":""},null,null,{"$f":"$B$24","v":"สนามโรงเรียน"},{"$f":"$C$24","v":"ห้อง ป.1/1"},{"$f":"$D$24","v":"ห้อง ป.1/1"},{"$f":"$E$24","v":"ห้องวิทย์"},{"$f":"$F$24","v":"โรงอาหาร"},{"$f":"$G$24","v":"ห้อง ป.1/1"},{"$f":"$H$24","v":"ห้อง ป.1/1"},{"$f":"$I$24","v":"ห้อง ป.1/1"},{"$f":"$J$24","v":""},{"$f":"$K$24","v":""},{"$f":"$L$24","v":""},{"$f":"$M$24","v":""}]
[{"$f":"$A$25","v":"เสาร์"},{"$f":"$B$25","v":""},{"$f":"$C$25","v":""},{"$f":"$D$25","v":""},{"$f":"$E$25","v":""},{"$f":"$F$25","v":""},{"$f":"$G$25","v":""},{"$f":"$H$25","v":""},{"$f":"$I$25","v":""},{"$f":"$J$25","v":""},{"$f":"$K$25","v":""},{"$f":"$L$25","v":""},{"$f":"$M$25","v":""},null,{"$f":"$A$25","v":"เสาร์"},{"$f":"$B$25","v":""},{"$f":"$C$25","v":""},{"$f":"$D$25","v":""},{"$f":"$E$25","v":""},{"$f":"$F$25","v":""},{"$f":"$G$25","v":""},{"$f":"$H$25","v":""},{"$f":"$I$25","v":""},{"$f":"$J$25","v":""},{"$f":"$K$25","v":""},{"$f":"$L$25","v":""},{"$f":"$M$25","v":""}]
[null,{"$f":"$B$26","v":""},{"$f":"$C$26","v":""},{"$f":"$D$26","v":""},{"$f":"$E$26","v":""},{"$f":"$F$26","v":""},{"$f":"$G$26","v":""},{"$f":"$H$26","v":""},{"$f":"$I$26","v":""},{"$f":"$J$26","v":""},{"$f":"$K$26","v":""},{"$f":"$L$26","v":""},{"$f":"$M$26","v":""},null,null,{"$f":"$B$26","v":""},{"$f":"$C$26","v":""},{"$f":"$D$26","v":""},{"$f":"$E$26","v":""},{"$f":"$F$26","v":""},{"$f":"$G$26","v":""},{"$f":"$H$26","v":""},{"$f":"$I$26","v":""},{"$f":"$J$26","v":""},{"$f":"$K$26","v":""},{"$f":"$L$26","v":""},{"$f":"$M$26","v":""}]
[null,{"$f":"$B$27","v":""},{"$f":"$C$27","v":""},{"$f":"$D$27","v":""},{"$f":"$E$27","v":""},{"$f":"$F$27","v":""},{"$f":"$G$27","v":""},{"$f":"$H$27","v":""},{"$f":"$I$27","v":""},{"$f":"$J$27","v":""},{"$f":"$K$27","v":""},{"$f":"$L$27","v":""},{"$f":"$M$27","v":""},null,null,{"$f":"$B$27","v":""},{"$f":"$C$27","v":""},{"$f":"$D$27","v":""},{"$f":"$E$27","v":""},{"$f":"$F$27","v":""},{"$f":"$G$27","v":""},{"$f":"$H$27","v":""},{"$f":"$I$27","v":""},{"$f":"$J$27","v":""},{"$f":"$K$27","v":""},{"$f":"$L$27","v":""},{"$f":"$M$27","v":""}]
[{"$f":"$A$28","v":"อาทิตย์"},{"$f":"$B$28","v":""},{"$f":"$C$28","v":""},{"$f":"$D$28","v":""},{"$f":"$E$28","v":""},{"$f":"$F$28","v":""},{"$f":"$G$28","v":""},{"$f":"$H$28","v":""},{"$f":"$I$28","v":""},{"$f":"$J$28","v":""},{"$f":"$K$28","v":""},{"$f":"$L$28","v":""},{"$f":"$M$28","v":""},null,{"$f":"$A$28","v":"อาทิตย์"},{"$f":"$B$28","v":""},{"$f":"$C$28","v":""},{"$f":"$D$28","v":""},{"$f":"$E$28","v":""},{"$f":"$F$28","v":""},{"$f":"$G$28","v":""},{"$f":"$H$28","v":""},{"$f":"$I$28","v":""},{"$f":"$J$28","v":""},{"$f":"$K$28","v":""},{"$f":"$L$28","v":""},{"$f":"$M$28","v":""}]
[null,{"$f":"$B$29","v":""},{"$f":"$C$29","v":""},{"$f":"$D$29","v":""},{"$f":"$E$29","v":""},{"$f":"$F$29","v":""},{"$f":"$G$29","v":""},{"$f":"$H$29","v":""},{"$f":"$I$29","v":""},{"$f":"$J$29","v":""},{"$f":"$K$29","v":""},{"$f":"$L$29","v":""},{"$f":"$M$29","v":""},null,null,{"$f":"$B$29","v":""},{"$f":"$C$29","v":""},{"$f":"$D$29","v":""},{"$f":"$E$29","v":""},{"$f":"$F$29","v":""},{"$f":"$G$29","v":""},{"$f":"$H$29","v":""},{"$f":"$I$29","v":""},{"$f":"$J$29","v":""},{"$f":"$K$29","v":""},{"$f":"$L$29","v":""},{"$f":"$M$29","v":""}]
[null,{"$f":"$B$30","v":""},{"$f":"$C$30","v":""},{"$f":"$D$30","v":""},{"$f":"$E$30","v":""},{"$f":"$F$30","v":""},{"$f":"$G$30","v":""},{"$f":"$H$30","v":""},{"$f":"$I$30","v":""},{"$f":"$J$30","v":""},{"$f":"$K$30","v":""},{"$f":"$L$30","v":""},{"$f":"$M$30","v":""},null,null,{"$f":"$B$30","v":""},{"$f":"$C$30","v":""},{"$f":"$D$30","v":""},{"$f":"$E$30","v":""},{"$f":"$F$30","v":""},{"$f":"$G$30","v":""},{"$f":"$H$30","v":""},{"$f":"$I$30","v":""},{"$f":"$J$30","v":""},{"$f":"$K$30","v":""},{"$f":"$L$30","v":""},{"$f":"$M$30","v":""}]

{"sheet":"พิมพ์ตารางสอนครู","index":13,"n_rows":25,"n_cols":13,"rows_kept":25,"cut":false,"hidden":false,"merged":[[21,0,23,0],[24,0,26,0],[0,0,0,12],[1,0,1,12],[3,0,4,0],[3,1,3,12],[6,0,8,0],[9,0,11,0],[12,0,14,0],[15,0,17,0],[18,0,20,0],[2,0,2,12]]}
[{"$f":"\"โรงเรียน\" & ตั้งค่า!C12 & \" \" & ตั้งค่า!C14","v":"โรงเรียนบ้านน้ำสอด สำนักงานเขตพื้นที่การศึกษาประถมศึกษาน่าน เขต 2"}]
["ตารางสอนของ นางสาวนลินี สุวรรณโภค  ภาคเรียนที่ 2 ปีการศึกษา 2559"]
[]
["วัน",{"$f":"IF(ตั้งค่า!C15=\"ชั่วโมง\",\"ชั่วโมงที่\",\"คาบที่\")","v":"ชั่วโมงที่"}]
[null,1,{"$f":"B5+1","v":2},{"$f":"C5+1","v":3},4,5,6,7,8,9,10,11,12]
["เวลา",{"$f":"ตารางเวลา!$B$2 & \" - \" & ตารางเวลา!$C$2","v":"8.00 - 8.30"},{"$f":"ตารางเวลา!$B$3 & \" - \" & ตารางเวลา!$C$3","v":"8.31 - 9.30"},{"$f":"ตารางเวลา!$B$4 & \" - \" & ตารางเวลา!$C$4","v":"9.31 - 10.30"},{"$f":"ตารางเวลา!$B$5 & \" - \" & ตารางเวลา!$C$5","v":"10.31 - 11.30"},{"$f":"ตารางเวลา!$B$6 & \" - \" & ตารางเวลา!$C$6","v":"11.31 - 12.30"},{"$f":"ตารางเวลา!$B$7 & \" - \" & ตารางเวลา!$C$7","v":"12.31 - 13.30"},{"$f":"ตารางเวลา!$B$8 & \" - \" & ตารางเวลา!$C$8","v":"13.31 - 14.30"},{"$f":"ตารางเวลา!$B$9 & \" - \" & ตารางเวลา!$C$9","v":"14.31 - 15.30"},{"$f":"ตารางเวลา!$B$10 & \" - \" & ตารางเวลา!$C$10","v":" - "},{"$f":"ตารางเวลา!$B$11 & \" - \" & ตารางเวลา!$C$11","v":" - "},{"$f":"ตารางเวลา!$B$12 & \" - \" & ตารางเวลา!$C$12","v":" - "},{"$f":"ตารางเวลา!$B$13 & \" - \" & ตารางเวลา!$C$13","v":" - "}]
["จันทร์",null,"ค11101","ท11101","ศ11101-2",null,"ง11101-1"]
[null,"หน้าเสาธง","คณิต1","ไทย1","ดนตรี1","พักกลางวัน","กอท1"]
[null,null,"ป.1/1","ป.1/1","ป.1/1",null,"ป.1/1"]
["อังคาร",null,"ท11101","ค11101","ส11102",null,"ศ11101-1","ก11901","ก11906"]
[null,"หน้าเสาธง","ไทย1","คณิต1","ประวัติ1","พักกลางวัน","ศิลปะ1","แนะแนว1","ลดเวลาเรียน"]
[null,null,"ป.1/1","ป.1/1","ป.1/1",null,"ป.1/1","ป.1/1","ป.1/1"]
["พุธ",null,"ท11101","ส11101","ค11101",null,"พ11101-1","ก11902","ก11906"]
[null,"หน้าเสาธง","ไทย1","สังคม1","คณิต1","พักกลางวัน","สุขะ1","ลูกเสือ1","ลดเวลาเรียน"]
[null,null,"ป.1/1","ป.1/1","ป.1/1",null,"ป.1/1","ป.1/1","ป.1/1"]
["พฤหัสบดี",null,null,"ค11101","ท11101",null,null,"พ11101-2","ก11906"]
[null,"หน้าเสาธง",null,"คณิต1","ไทย1","พักกลางวัน",null,"พละ1","ลดเวลาเรียน"]
[null,null,null,"ป.1/1","ป.1/1",null,null,"ป.1/1","ป.1/1"]
["ศุกร์",null,"ค11101","ท11101",null,null,"ส11101","ก11903","ก11906"]
[null,"หน้าเสาธง","คณิต1","ไทย1",null,"พักกลางวัน","สังคม1","ชุมนุม1","ลดเวลาเรียน"]
[null,null,"ป.1/1","ป.1/1",null,null,"ป.1/1","ป.1/1","ป.1/1"]
["เสาร์"]
[]
[]
["อาทิตย์"]

{"sheet":"Teacher1","index":14,"n_rows":25,"n_cols":13,"rows_kept":25,"cut":false,"hidden":true,"merged":[[12,0,14,0],[15,0,17,0],[18,0,20,0],[21,0,23,0],[24,0,26,0],[9,0,11,0],[0,0,0,12],[1,0,1,12],[3,0,4,0],[3,1,3,12],[6,0,8,0]]}
[{"$f":"\"โรงเรียน\" & ตั้งค่า!C12 & \" \" & ตั้งค่า!C14","v":"โรงเรียนบ้านน้ำสอด สำนักงานเขตพื้นที่การศึกษาประถมศึกษาน่าน เขต 2"}]
["ตารางสอนของ นางสาวนลินี  สุวรรณโภค  ภาคเรียนที่ 2 ปีการศึกษา 2559"]
[]
["วัน",{"$f":"IF(ตั้งค่า!C15=\"ชั่วโมง\",\"ชั่วโมงที่\",\"คาบที่\")","v":"ชั่วโมงที่"}]
[null,1,{"$f":"B5+1","v":2},{"$f":"C5+1","v":3},4,5,6,7,8,9,10,11,12]
["เวลา",{"$f":"ตารางเวลา!$B$2 & \" - \" & ตารางเวลา!$C$2","v":"8.00 - 8.30"},{"$f":"ตารางเวลา!$B$3 & \" - \" & ตารางเวลา!$C$3","v":"8.31 - 9.30"},{"$f":"ตารางเวลา!$B$4 & \" - \" & ตารางเวลา!$C$4","v":"9.31 - 10.30"},{"$f":"ตารางเวลา!$B$5 & \" - \" & ตารางเวลา!$C$5","v":"10.31 - 11.30"},{"$f":"ตารางเวลา!$B$6 & \" - \" & ตารางเวลา!$C$6","v":"11.31 - 12.30"},{"$f":"ตารางเวลา!$B$7 & \" - \" & ตารางเวลา!$C$7","v":"12.31 - 13.30"},{"$f":"ตารางเวลา!$B$8 & \" - \" & ตารางเวลา!$C$8","v":"13.31 - 14.30"},{"$f":"ตารางเวลา!$B$9 & \" - \" & ตารางเวลา!$C$9","v":"14.31 - 15.30"},{"$f":"ตารางเวลา!$B$10 & \" - \" & ตารางเวลา!$C$10","v":" - "},{"$f":"ตารางเวลา!$B$11 & \" - \" & ตารางเวลา!$C$11","v":" - "},{"$f":"ตารางเวลา!$B$12 & \" - \" & ตารางเวลา!$C$12","v":" - "},{"$f":"ตารางเวลา!$B$13 & \" - \" & ตารางเวลา!$C$13","v":" - "}]
["จันทร์",null,"ค11101","ท11101","ศ11101-2",null,"ง11101-1"]
[null,"หน้าเสาธง","คณิต1","ไทย1","ดนตรี1","พักกลางวัน","กอท1"]
[null,null,"ป.1/1","ป.1/1","ป.1/1",null,"ป.1/1"]
["อังคาร",null,"ท11101","ค11101","ส11102",null,"ศ11101-1","ก11901","ก11906"]
[null,"หน้าเสาธง","ไทย1","คณิต1","ประวัติ1","พักกลางวัน","ศิลปะ1","แนะแนว1","ลดเวลาเรียน"]
[null,null,"ป.1/1","ป.1/1","ป.1/1",null,"ป.1/1","ป.1/1","ป.1/1"]
["พุธ",null,"ท11101","ส11101","ค11101",null,"พ11101-1","ก11902","ก11906"]
[null,"หน้าเสาธง","ไทย1","สังคม1","คณิต1","พักกลางวัน","สุขะ1","ลูกเสือ1","ลดเวลาเรียน"]
[null,null,"ป.1/1","ป.1/1","ป.1/1",null,"ป.1/1","ป.1/1","ป.1/1"]
["พฤหัสบดี",null,null,"ค11101","ท11101",null,null,"พ11101-2","ก11906"]
[null,"หน้าเสาธง",null,"คณิต1","ไทย1","พักกลางวัน",null,"พละ1","ลดเวลาเรียน"]
[null,null,null,"ป.1/1","ป.1/1",null,null,"ป.1/1","ป.1/1"]
["ศุกร์",null,"ค11101","ท11101",null,null,"ส11101","ก11903","ก11906"]
[null,"หน้าเสาธง","คณิต1","ไทย1",null,"พักกลางวัน","สังคม1","ชุมนุม1","ลดเวลาเรียน"]
[null,null,"ป.1/1","ป.1/1",null,null,"ป.1/1","ป.1/1","ป.1/1"]
["เสาร์"]
[]
[]
["อาทิตย์"]

{"sheet":"Teacher2","index":15,"n_rows":25,"n_cols":13,"rows_kept":25,"cut":false,"hidden":true,"merged":[[9,0,11,0],[0,0,0,12],[1,0,1,12],[3,0,4,0],[3,1,3,12],[6,0,8,0],[12,0,14,0],[15,0,17,0],[18,0,20,0],[21,0,23,0],[24,0,26,0]]}
[{"$f":"\"โรงเรียน\" & ตั้งค่า!C12 & \" \" & ตั้งค่า!C14","v":"โรงเรียนบ้านน้ำสอด สำนักงานเขตพื้นที่การศึกษาประถมศึกษาน่าน เขต 2"}]
["ตารางสอนของ นายปิยพล  ยศศิริพันธุ์  ภาคเรียนที่ 2 ปีการศึกษา 2559"]
[]
["วัน",{"$f":"IF(ตั้งค่า!C15=\"ชั่วโมง\",\"ชั่วโมงที่\",\"คาบที่\")","v":"ชั่วโมงที่"}]
[null,1,{"$f":"B5+1","v":2},{"$f":"C5+1","v":3},4,5,6,7,8,9,10,11,12]
["เวลา",{"$f":"ตารางเวลา!$B$2 & \" - \" & ตารางเวลา!$C$2","v":"8.00 - 8.30"},{"$f":"ตารางเวลา!$B$3 & \" - \" & ตารางเวลา!$C$3","v":"8.31 - 9.30"},{"$f":"ตารางเวลา!$B$4 & \" - \" & ตารางเวลา!$C$4","v":"9.31 - 10.30"},{"$f":"ตารางเวลา!$B$5 & \" - \" & ตารางเวลา!$C$5","v":"10.31 - 11.30"},{"$f":"ตารางเวลา!$B$6 & \" - \" & ตารางเวลา!$C$6","v":"11.31 - 12.30"},{"$f":"ตารางเวลา!$B$7 & \" - \" & ตารางเวลา!$C$7","v":"12.31 - 13.30"},{"$f":"ตารางเวลา!$B$8 & \" - \" & ตารางเวลา!$C$8","v":"13.31 - 14.30"},{"$f":"ตารางเวลา!$B$9 & \" - \" & ตารางเวลา!$C$9","v":"14.31 - 15.30"},{"$f":"ตารางเวลา!$B$10 & \" - \" & ตารางเวลา!$C$10","v":" - "},{"$f":"ตารางเวลา!$B$11 & \" - \" & ตารางเวลา!$C$11","v":" - "},{"$f":"ตารางเวลา!$B$12 & \" - \" & ตารางเวลา!$C$12","v":" - "},{"$f":"ตารางเวลา!$B$13 & \" - \" & ตารางเวลา!$C$13","v":" - "}]
["จันทร์",null,null,null,"ศ12101-2",null,"ท12101","พ12101-1"]
[null,"หน้าเสาธง",null,null,"ดนตรี2","พักกลางวัน","ไทย2","สุขะ2"]
[null,null,null,null,"ป.2/1",null,"ป.2/1","ป.2/1"]
["อังคาร",null,null,"ท12101",null,null,null,"ก12901"]
[null,"หน้าเสาธง",null,"ไทย2",null,"พักกลางวัน",null,"แนะแนว2"]
[null,null,null,"ป.2/1",null,null,null,"ป.2/1"]
["พุธ",null,null,null,"ท12101",null,"ส12101","ก12902"]
[null,"หน้าเสาธง",null,null,"ไทย2","พักกลางวัน","สังคม2","ลูกเสือ2"]
[null,null,null,null,"ป.2/1",null,"ป.2/1","ป.2/1"]
["พฤหัสบดี",null,null,"ท12101","ส12101",null,"ง12101-1","พ12101-2"]
[null,"หน้าเสาธง",null,"ไทย2","สังคม2","พักกลางวัน","กอท2","พละ2"]
[null,null,null,"ป.2/1","ป.2/1",null,"ป.2/1","ป.2/1"]
["ศุกร์",null,"ท12101",null,"ส12102",null,"ศ12101-1","ก12903"]
[null,"หน้าเสาธง","ไทย2",null,"ประวัติ2","พักกลางวัน","ศิลปะ2","ชุมนุม2"]
[null,null,"ป.2/1",null,"ป.2/1",null,"ป.2/1","ป.2/1"]
["เสาร์"]
[]
[]
["อาทิตย์"]

{"sheet":"Teacher3","index":16,"n_rows":25,"n_cols":13,"rows_kept":25,"cut":false,"hidden":true,"merged":[[9,0,11,0],[0,0,0,12],[1,0,1,12],[3,0,4,0],[3,1,3,12],[6,0,8,0],[12,0,14,0],[15,0,17,0],[18,0,20,0],[21,0,23,0],[24,0,26,0]]}
[{"$f":"\"โรงเรียน\" & ตั้งค่า!C12 & \" \" & ตั้งค่า!C14","v":"โรงเรียนบ้านน้ำสอด สำนักงานเขตพื้นที่การศึกษาประถมศึกษาน่าน เขต 2"}]
["ตารางสอนของ นายชัยณรงค์  ธรรมสละ  ภาคเรียนที่ 2 ปีการศึกษา 2559"]
[]
["วัน",{"$f":"IF(ตั้งค่า!C15=\"ชั่วโมง\",\"ชั่วโมงที่\",\"คาบที่\")","v":"ชั่วโมงที่"}]
[null,1,{"$f":"B5+1","v":2},{"$f":"C5+1","v":3},4,5,6,7,8,9,10,11,12]
["เวลา",{"$f":"ตารางเวลา!$B$2 & \" - \" & ตารางเวลา!$C$2","v":"8.00 - 8.30"},{"$f":"ตารางเวลา!$B$3 & \" - \" & ตารางเวลา!$C$3","v":"8.31 - 9.30"},{"$f":"ตารางเวลา!$B$4 & \" - \" & ตารางเวลา!$C$4","v":"9.31 - 10.30"},{"$f":"ตารางเวลา!$B$5 & \" - \" & ตารางเวลา!$C$5","v":"10.31 - 11.30"},{"$f":"ตารางเวลา!$B$6 & \" - \" & ตารางเวลา!$C$6","v":"11.31 - 12.30"},{"$f":"ตารางเวลา!$B$7 & \" - \" & ตารางเวลา!$C$7","v":"12.31 - 13.30"},{"$f":"ตารางเวลา!$B$8 & \" - \" & ตารางเวลา!$C$8","v":"13.31 - 14.30"},{"$f":"ตารางเวลา!$B$9 & \" - \" & ตารางเวลา!$C$9","v":"14.31 - 15.30"},{"$f":"ตารางเวลา!$B$10 & \" - \" & ตารางเวลา!$C$10","v":" - "},{"$f":"ตารางเวลา!$B$11 & \" - \" & ตารางเวลา!$C$11","v":" - "},{"$f":"ตารางเวลา!$B$12 & \" - \" & ตารางเวลา!$C$12","v":" - "},{"$f":"ตารางเวลา!$B$13 & \" - \" & ตารางเวลา!$C$13","v":" - "}]
["จันทร์",null,"ท13101","ค13101","พ13101-1",null,"ศ13101-2","ส13101","ก12906"]
[null,"หน้าเสาธง","ไทย3","คณิต3","สุขะ3","พักกลางวัน","ดนตรี3","สังคม3","ลดเวลาเรียน"]
[null,null,"ป.3/1","ป.3/1","ป.3/1",null,"ป.3/1","ป.3/1","ป.3/1"]
["อังคาร",null,null,null,"ค13101",null,"ท13101","ก12901","ก12906"]
[null,"หน้าเสาธง",null,null,"คณิต3","พักกลางวัน","ไทย3","แนะแนว2","ลดเวลาเรียน"]
[null,null,null,null,"ป.3/1",null,"ป.3/1","ป.3/1","ป.3/1"]
["พุธ",null,"ค13101","ท13101",null,null,"ส13102","ก12902"]
[null,"หน้าเสาธง","คณิต3","ไทย3",null,"พักกลางวัน","ประวัติ3","ลูกเสือ2"]
[null,null,"ป.3/1","ป.3/1",null,null,"ป.3/1","ป.3/1"]
["พฤหัสบดี",null,"ท13101","ส13101","ค13101",null,"ศ13101-1","พ13101-2","ก12906"]
[null,"หน้าเสาธง","ไทย3","สังคม3","คณิต3","พักกลางวัน","ศิลปะ3","พละ3","ลดเวลาเรียน"]
[null,null,"ป.3/1","ป.3/1","ป.3/1",null,"ป.3/1","ป.3/1","ป.3/1"]
["ศุกร์",null,null,"ค13101","ท13101",null,"ง13101-1","ก12903","ก12906"]
[null,"หน้าเสาธง",null,"คณิต3","ไทย3","พักกลางวัน","กอท3","ชุมนุม2","ลดเวลาเรียน"]
[null,null,null,"ป.3/1","ป.3/1",null,"ป.3/1","ป.3/1","ป.3/1"]
["เสาร์"]
[]
[]
["อาทิตย์"]

{"sheet":"Teacher4","index":17,"n_rows":25,"n_cols":13,"rows_kept":25,"cut":false,"hidden":true,"merged":[[9,0,11,0],[0,0,0,12],[1,0,1,12],[3,0,4,0],[3,1,3,12],[6,0,8,0],[12,0,14,0],[15,0,17,0],[18,0,20,0],[21,0,23,0],[24,0,26,0]]}
[{"$f":"\"โรงเรียน\" & ตั้งค่า!C12 & \" \" & ตั้งค่า!C14","v":"โรงเรียนบ้านน้ำสอด สำนักงานเขตพื้นที่การศึกษาประถมศึกษาน่าน เขต 2"}]
["ตารางสอนของ นายเกียรติชัย  วัดคำ  ภาคเรียนที่ 2 ปีการศึกษา 2559"]
[]
["วัน",{"$f":"IF(ตั้งค่า!C15=\"ชั่วโมง\",\"ชั่วโมงที่\",\"คาบที่\")","v":"ชั่วโมงที่"}]
[null,1,{"$f":"B5+1","v":2},{"$f":"C5+1","v":3},4,5,6,7,8,9,10,11,12]
["เวลา",{"$f":"ตารางเวลา!$B$2 & \" - \" & ตารางเวลา!$C$2","v":"8.00 - 8.30"},{"$f":"ตารางเวลา!$B$3 & \" - \" & ตารางเวลา!$C$3","v":"8.31 - 9.30"},{"$f":"ตารางเวลา!$B$4 & \" - \" & ตารางเวลา!$C$4","v":"9.31 - 10.30"},{"$f":"ตารางเวลา!$B$5 & \" - \" & ตารางเวลา!$C$5","v":"10.31 - 11.30"},{"$f":"ตารางเวลา!$B$6 & \" - \" & ตารางเวลา!$C$6","v":"11.31 - 12.30"},{"$f":"ตารางเวลา!$B$7 & \" - \" & ตารางเวลา!$C$7","v":"12.31 - 13.30"},{"$f":"ตารางเวลา!$B$8 & \" - \" & ตารางเวลา!$C$8","v":"13.31 - 14.30"},{"$f":"ตารางเวลา!$B$9 & \" - \" & ตารางเวลา!$C$9","v":"14.31 - 15.30"},{"$f":"ตารางเวลา!$B$10 & \" - \" & ตารางเวลา!$C$10","v":" - "},{"$f":"ตารางเวลา!$B$11 & \" - \" & ตารางเวลา!$C$11","v":" - "},{"$f":"ตารางเวลา!$B$12 & \" - \" & ตารางเวลา!$C$12","v":" - "},{"$f":"ตารางเวลา!$B$13 & \" - \" & ตารางเวลา!$C$13","v":" - "}]
["จันทร์",null,"ส14101","ศ14101-2","ท14101",null,"ศ16101-1",null,"ก14906"]
[null,"หน้าเสาธง","สังคม4","ดนตรี4","ไทย4","พักกลางวัน","ศิลปะ6",null,"ลดเวลาเรียน"]
[null,null,"ป.4/1","ป.4/1","ป.4/1",null,"ป.6/1",null,"ป.4/1"]
["อังคาร",null,"ค14101","ท14101","ส14102",null,"ศ14101-1","ก14901","ก14906"]
[null,"หน้าเสาธง","คณิต4","ไทย4","ประวัติ4","พักกลางวัน","ศิลปะ4","แนะแนว4","ลดเวลาเรียน"]
[null,null,"ป.4/1","ป.4/1","ป.4/1",null,"ป.4/1","ป.4/1","ป.4/1"]
["พุธ",null,"ท14101",null,"ค14101",null,null,"ก14902","ก14906"]
[null,"หน้าเสาธง","ไทย4",null,"คณิต4","พักกลางวัน",null,"ลูกเสือ4","ลดเวลาเรียน"]
[null,null,"ป.4/1",null,"ป.4/1",null,null,"ป.4/1","ป.4/1"]
["พฤหัสบดี",null,"ค14101",null,"ง14101-1",null,"ศ16101-2",null,"ก14906"]
[null,"หน้าเสาธง","คณิต4",null,"กอท4","พักกลางวัน","ดนตรี6",null,"ลดเวลาเรียน"]
[null,null,"ป.4/1",null,"ป.4/1",null,"ป.6/1",null,"ป.4/1"]
["ศุกร์",null,null,"ท14101","ค14101",null,"ส14101","ก14903","ก14906"]
[null,"หน้าเสาธง",null,"ไทย4","คณิต4","พักกลางวัน","สังคม4","ชุมนุม4","ลดเวลาเรียน"]
[null,null,null,"ป.4/1","ป.4/1",null,"ป.4/1","ป.4/1","ป.4/1"]
["เสาร์"]
[]
[]
["อาทิตย์"]

{"sheet":"Teacher5","index":18,"n_rows":25,"n_cols":13,"rows_kept":25,"cut":false,"hidden":true,"merged":[[9,0,11,0],[0,0,0,12],[1,0,1,12],[3,0,4,0],[3,1,3,12],[6,0,8,0],[12,0,14,0],[15,0,17,0],[18,0,20,0],[21,0,23,0],[24,0,26,0]]}
[{"$f":"\"โรงเรียน\" & ตั้งค่า!C12 & \" \" & ตั้งค่า!C14","v":"โรงเรียนบ้านน้ำสอด สำนักงานเขตพื้นที่การศึกษาประถมศึกษาน่าน เขต 2"}]
["ตารางสอนของ นายบุญธรรม  บุญลาภังค์  ภาคเรียนที่ 2 ปีการศึกษา 2559"]
[]
["วัน",{"$f":"IF(ตั้งค่า!C15=\"ชั่วโมง\",\"ชั่วโมงที่\",\"คาบที่\")","v":"ชั่วโมงที่"}]
[null,1,{"$f":"B5+1","v":2},{"$f":"C5+1","v":3},4,5,6,7,8,9,10,11,12]
["เวลา",{"$f":"ตารางเวลา!$B$2 & \" - \" & ตารางเวลา!$C$2","v":"8.00 - 8.30"},{"$f":"ตารางเวลา!$B$3 & \" - \" & ตารางเวลา!$C$3","v":"8.31 - 9.30"},{"$f":"ตารางเวลา!$B$4 & \" - \" & ตารางเวลา!$C$4","v":"9.31 - 10.30"},{"$f":"ตารางเวลา!$B$5 & \" - \" & ตารางเวลา!$C$5","v":"10.31 - 11.30"},{"$f":"ตารางเวลา!$B$6 & \" - \" & ตารางเวลา!$C$6","v":"11.31 - 12.30"},{"$f":"ตารางเวลา!$B$7 & \" - \" & ตารางเวลา!$C$7","v":"12.31 - 13.30"},{"$f":"ตารางเวลา!$B$8 & \" - \" & ตารางเวลา!$C$8","v":"13.31 - 14.30"},{"$f":"ตารางเวลา!$B$9 & \" - \" & ตารางเวลา!$C$9","v":"14.31 - 15.30"},{"$f":"ตารางเวลา!$B$10 & \" - \" & ตารางเวลา!$C$10","v":" - "},{"$f":"ตารางเวลา!$B$11 & \" - \" & ตารางเวลา!$C$11","v":" - "},{"$f":"ตารางเวลา!$B$12 & \" - \" & ตารางเวลา!$C$12","v":" - "},{"$f":"ตารางเวลา!$B$13 & \" - \" & ตารางเวลา!$C$13","v":" - "}]
["จันทร์",null,"ค15101",null,"ศ15101-2",null,"ท15101","ง16101-2","ก11905"]
[null,"หน้าเสาธง","คณิต5",null,"ดนตรี5","พักกลางวัน","ไทย5","คอมพิวเตอร์","ICT1"]
[null,null,"ป.5/1",null,"ป.5/1",null,"ป.5/1","ป.6/1","ป.1/1"]
["อังคาร",null,"ท15101","ค15101",null,null,"ก15901","ง15101-1","ก12905"]
[null,"หน้าเสาธง","ไทย5","คณิต5",null,"พักกลางวัน","แนะแนว5","กอท5","ICT2"]
[null,null,"ป.5/1","ป.5/1",null,null,"ป.5/1","ป.5/1","ป.2/1"]
["พุธ",null,null,"ค15101","ท15101",null,"ง14101-2","ก15902","ก12905"]
[null,"หน้าเสาธง",null,"คณิต5","ไทย5","พักกลางวัน","คอมพิวเตอร์","ลูกเสือ5","ICT2"]
[null,null,null,"ป.5/1","ป.5/1",null,"ป.4/1","ป.5/1","ป.3/1"]
["พฤหัสบดี",null,"ท15101",null,"ง15101-2",null,null,"ง16101-1","ก15906-2"]
[null,"หน้าเสาธง","ไทย5",null,"คอมพิวเตอร์","พักกลางวัน",null,"กอท6","ลดเวลาเรียน"]
[null,null,"ป.5/1",null,"ป.5/1",null,null,"ป.6/1","ป.5/1"]
["ศุกร์",null,"ค15101",null,null,null,"ศ15101-1","ก15903","ก15906-2"]
[null,"หน้าเสาธง","คณิต5",null,null,"พักกลางวัน","ศิลปะ5","ชุมนุม5","ลดเวลาเรียน"]
[null,null,"ป.5/1",null,null,null,"ป.5/1","ป.5/1","ป.5/1"]
["เสาร์"]
[]
[]
["อาทิตย์"]

{"sheet":"Teacher6","index":19,"n_rows":25,"n_cols":13,"rows_kept":25,"cut":false,"hidden":true,"merged":[[9,0,11,0],[0,0,0,12],[1,0,1,12],[3,0,4,0],[3,1,3,12],[6,0,8,0],[12,0,14,0],[15,0,17,0],[18,0,20,0],[21,0,23,0],[24,0,26,0]]}
[{"$f":"\"โรงเรียน\" & ตั้งค่า!C12 & \" \" & ตั้งค่า!C14","v":"โรงเรียนบ้านน้ำสอด สำนักงานเขตพื้นที่การศึกษาประถมศึกษาน่าน เขต 2"}]
["ตารางสอนของ นายอุทัย  รัตนกันทา  ภาคเรียนที่ 2 ปีการศึกษา 2559"]
[]
["วัน",{"$f":"IF(ตั้งค่า!C15=\"ชั่วโมง\",\"ชั่วโมงที่\",\"คาบที่\")","v":"ชั่วโมงที่"}]
[null,1,{"$f":"B5+1","v":2},{"$f":"C5+1","v":3},4,5,6,7,8,9,10,11,12]
["เวลา",{"$f":"ตารางเวลา!$B$2 & \" - \" & ตารางเวลา!$C$2","v":"8.00 - 8.30"},{"$f":"ตารางเวลา!$B$3 & \" - \" & ตารางเวลา!$C$3","v":"8.31 - 9.30"},{"$f":"ตารางเวลา!$B$4 & \" - \" & ตารางเวลา!$C$4","v":"9.31 - 10.30"},{"$f":"ตารางเวลา!$B$5 & \" - \" & ตารางเวลา!$C$5","v":"10.31 - 11.30"},{"$f":"ตารางเวลา!$B$6 & \" - \" & ตารางเวลา!$C$6","v":"11.31 - 12.30"},{"$f":"ตารางเวลา!$B$7 & \" - \" & ตารางเวลา!$C$7","v":"12.31 - 13.30"},{"$f":"ตารางเวลา!$B$8 & \" - \" & ตารางเวลา!$C$8","v":"13.31 - 14.30"},{"$f":"ตารางเวลา!$B$9 & \" - \" & ตารางเวลา!$C$9","v":"14.31 - 15.30"},{"$f":"ตารางเวลา!$B$10 & \" - \" & ตารางเวลา!$C$10","v":" - "},{"$f":"ตารางเวลา!$B$11 & \" - \" & ตารางเวลา!$C$11","v":" - "},{"$f":"ตารางเวลา!$B$12 & \" - \" & ตารางเวลา!$C$12","v":" - "},{"$f":"ตารางเวลา!$B$13 & \" - \" & ตารางเวลา!$C$13","v":" - "}]
["จันทร์",null,"ท16101","ส16101","ค16101",null,null,"พ14101-1","ก16906"]
[null,"หน้าเสาธง","ไทย6","สังคม6","คณิต6","พักกลางวัน",null,"สุขะ4","ลดเวลาเรียน"]
[null,null,"ป.6/1","ป.6/1","ป.6/1",null,null,"ป.4/1","ป.6/1"]
["อังคาร",null,"ค16101",null,"ส16102",null,null,"พ16101-2","ก16906"]
[null,"หน้าเสาธง","คณิต6",null,"ประวัติ6","พักกลางวัน",null,"พละ6","ลดเวลาเรียน"]
[null,null,"ป.6/1",null,"ป.6/1",null,null,"ป.6/1","ป.6/1"]
["พุธ",null,"ส16101","ท16101","ก16901",null,"พ15101-1","ก16902","ก16906"]
[null,"หน้าเสาธง","สังคม6","ไทย6","แนะแนว6","พักกลางวัน","สุขะ5","ลูกเสือ6","ลดเวลาเรียน"]
[null,null,"ป.6/1","ป.6/1","ป.6/1",null,"ป.5/1","ป.6/1","ป.6/1"]
["พฤหัสบดี",null,"ค16101","ท16101",null,null,"พ14101-2","พ15101-2","ก16906"]
[null,"หน้าเสาธง","คณิต6","ไทย6",null,"พักกลางวัน","พละ4","พละ5","ลดเวลาเรียน"]
[null,null,"ป.6/1","ป.6/1",null,null,"ป.4/1","ป.5/1","ป.6/1"]
["ศุกร์",null,"ท16101","ค16101","พ16101-1",null,null,"ก16903","ก16906"]
[null,"หน้าเสาธง","ไทย6","คณิต6","สุขะ6","พักกลางวัน",null,"ชุมนุม6","ลดเวลาเรียน"]
[null,null,"ป.6/1","ป.6/1","ป.6/1",null,null,"ป.6/1","ป.6/1"]
["เสาร์"]
[]
[]
["อาทิตย์"]

{"sheet":"พิมพ์ตารางสอนแบบย่อส่วน","index":20,"n_rows":86,"n_cols":30,"rows_kept":86,"cut":false,"hidden":false,"merged":[[83,0,85,0],[83,14,85,14],[1,27,1,28],[74,0,76,0],[74,14,76,14],[77,0,79,0],[77,14,79,14],[80,0,82,0],[80,14,82,14],[65,0,67,0],[65,14,67,14],[68,0,70,0],[68,14,70,14],[71,0,73,0],[71,14,73,14],[59,0,59,12],[60,0,60,12],[60,14,60,26],[62,0,63,0],[62,1,62,12],[62,14,63,14],[62,15,62,26],[52,0,54,0],[52,14,54,14],[55,0,57,0],[55,14,57,14],[59,14,59,26],[43,0,45,0],[43,14,45,14],[46,0,48,0],[46,14,48,14],[49,0,51,0],[49,14,51,14],[34,14,35,14],[34,15,34,26],[37,0,39,0],[37,14,39,14],[40,0,42,0],[40,14,42,14],[1,0,1,26],[3,0,3,12],[3,14,3,26],[4,0,4,12],[4,14,4,26],[43,27,45,28],[43,29,45,29],[6,0,7,0],[6,1,6,12],[6,14,7,14],[6,15,6,26],[9,0,11,0],[9,14,11,14],[12,0,14,0],[12,14,14,14],[15,0,17,0],[15,14,17,14],[18,0,20,0],[18,14,20,14],[21,0,23,0],[21,14,23,14],[34,27,36,30],[37,27,39,28],[37,29,39,29],[40,27,42,28],[40,29,42,29],[5,0,5,12],[5,14,5,26],[33,0,33,12],[33,14,33,26],[61,0,61,12],[61,14,61,26],[24,0,26,0],[24,14,26,14],[27,0,29,0],[27,14,29,14],[31,0,31,12],[31,14,31,26],[32,0,32,12],[32,14,32,26],[34,0,35,0],[34,1,34,12]]}
[]
["ตารางสอนแบบย่อส่วน สำหรับตัดแจกครูผู้สอน",null,null,null,null,null,null,null,null,null,null,null,null,null,null,null,null,null,null,null,null,null,null,null,null,null,null,"เลือกหน้าที่จะพิมพ์ ",null,1]
[]
[{"$f":"IF(Teacher1!A1=\"\",\"\",Teacher1!A1)","v":"โรงเรียนบ้านน้ำสอด สำนักงานเขตพื้นที่การศึกษาประถมศึกษาน่าน เขต 2"},null,null,null,null,null,null,null,null,null,null,null,null,null,{"$f":"IF(Teacher2!A1=\"\",\"\",Teacher2!A1)","v":"โรงเรียนบ้านน้ำสอด สำนักงานเขตพื้นที่การศึกษาประถมศึกษาน่าน เขต 2"},null,null,null,null,null,null,null,null,null,null,null,null,null," "]
[{"$f":"IF(Teacher1!A2=\"\",\"\",Teacher1!A2)","v":"ตารางสอนของ นางสาวนลินี  สุวรรณโภค  ภาคเรียนที่ 2 ปีการศึกษา 2559"},null,null,null,null,null,null,null,null,null,null,null,null,null,{"$f":"IF(Teacher2!A2=\"\",\"\",Teacher2!A2)","v":"ตารางสอนของ นายปิยพล  ยศศิริพันธุ์  ภาคเรียนที่ 2 ปีการศึกษา 2559"}]
[]
[{"$f":"IF(Teacher1!A4=\"\",\"\",Teacher1!A4)","v":"วัน"},{"$f":"IF(Teacher1!B4=\"\",\"\",Teacher1!B4)","v":"ชั่วโมงที่"},null,null,null,null,null,null,null,null,null,null,null,null,{"$f":"IF(Teacher2!A4=\"\",\"\",Teacher2!A4)","v":"วัน"},{"$f":"IF(Teacher2!B4=\"\",\"\",Teacher2!B4)","v":"ชั่วโมงที่"}]
[null,{"$f":"IF(Teacher1!B5=\"\",\"\",Teacher1!B5)","v":1},{"$f":"IF(Teacher1!C5=\"\",\"\",Teacher1!C5)","v":2},{"$f":"IF(Teacher1!D5=\"\",\"\",Teacher1!D5)","v":3},{"$f":"IF(Teacher1!E5=\"\",\"\",Teacher1!E5)","v":4},{"$f":"IF(Teacher1!F5=\"\",\"\",Teacher1!F5)","v":5},{"$f":"IF(Teacher1!G5=\"\",\"\",Teacher1!G5)","v":6},{"$f":"IF(Teacher1!H5=\"\",\"\",Teacher1!H5)","v":7},{"$f":"IF(Teacher1!I5=\"\",\"\",Teacher1!I5)","v":8},{"$f":"IF(Teacher1!J5=\"\",\"\",Teacher1!J5)","v":9},{"$f":"IF(Teacher1!K5=\"\",\"\",Teacher1!K5)","v":10},{"$f":"IF(Teacher1!L5=\"\",\"\",Teacher1!L5)","v":11},{"$f":"IF(Teacher1!M5=\"\",\"\",Teacher1!M5)","v":12},null,null,{"$f":"IF(Teacher2!B5=\"\",\"\",Teacher2!B5)","v":1},{"$f":"IF(Teacher2!C5=\"\",\"\",Teacher2!C5)","v":2},{"$f":"IF(Teacher2!D5=\"\",\"\",Teacher2!D5)","v":3},{"$f":"IF(Teacher2!E5=\"\",\"\",Teacher2!E5)","v":4},{"$f":"IF(Teacher2!F5=\"\",\"\",Teacher2!F5)","v":5},{"$f":"IF(Teacher2!G5=\"\",\"\",Teacher2!G5)","v":6},{"$f":"IF(Teacher2!H5=\"\",\"\",Teacher2!H5)","v":7},{"$f":"IF(Teacher2!I5=\"\",\"\",Teacher2!I5)","v":8},{"$f":"IF(Teacher2!J5=\"\",\"\",Teacher2!J5)","v":9},{"$f":"IF(Teacher2!K5=\"\",\"\",Teacher2!K5)","v":10},{"$f":"IF(Teacher2!L5=\"\",\"\",Teacher2!L5)","v":11},{"$f":"IF(Teacher2!M5=\"\",\"\",Teacher2!M5)","v":12}]
[{"$f":"IF(Teacher1!A6=\"\",\"\",Teacher1!A6)","v":"เวลา"},{"$f":"IF(Teacher1!B6=\"\",\"\",Teacher1!B6)","v":"8.00 - 8.30"},{"$f":"IF(Teacher1!C6=\"\",\"\",Teacher1!C6)","v":"8.31 - 9.30"},{"$f":"IF(Teacher1!D6=\"\",\"\",Teacher1!D6)","v":"9.31 - 10.30"},{"$f":"IF(Teacher1!E6=\"\",\"\",Teacher1!E6)","v":"10.31 - 11.30"},{"$f":"IF(Teacher1!F6=\"\",\"\",Teacher1!F6)","v":"11.31 - 12.30"},{"$f":"IF(Teacher1!G6=\"\",\"\",Teacher1!G6)","v":"12.31 - 13.30"},{"$f":"IF(Teacher1!H6=\"\",\"\",Teacher1!H6)","v":"13.31 - 14.30"},{"$f":"IF(Teacher1!I6=\"\",\"\",Teacher1!I6)","v":"14.31 - 15.30"},{"$f":"IF(Teacher1!J6=\"\",\"\",Teacher1!J6)","v":" - "},{"$f":"IF(Teacher1!K6=\"\",\"\",Teacher1!K6)","v":" - "},{"$f":"IF(Teacher1!L6=\"\",\"\",Teacher1!L6)","v":" - "},{"$f":"IF(Teacher1!M6=\"\",\"\",Teacher1!M6)","v":" - "},null,{"$f":"IF(Teacher2!A6=\"\",\"\",Teacher2!A6)","v":"เวลา"},{"$f":"IF(Teacher2!B6=\"\",\"\",Teacher2!B6)","v":"8.00 - 8.30"},{"$f":"IF(Teacher2!C6=\"\",\"\",Teacher2!C6)","v":"8.31 - 9.30"},{"$f":"IF(Teacher2!D6=\"\",\"\",Teacher2!D6)","v":"9.31 - 10.30"},{"$f":"IF(Teacher2!E6=\"\",\"\",Teacher2!E6)","v":"10.31 - 11.30"},{"$f":"IF(Teacher2!F6=\"\",\"\",Teacher2!F6)","v":"11.31 - 12.30"},{"$f":"IF(Teacher2!G6=\"\",\"\",Teacher2!G6)","v":"12.31 - 13.30"},{"$f":"IF(Teacher2!H6=\"\",\"\",Teacher2!H6)","v":"13.31 - 14.30"},{"$f":"IF(Teacher2!I6=\"\",\"\",Teacher2!I6)","v":"14.31 - 15.30"},{"$f":"IF(Teacher2!J6=\"\",\"\",Teacher2!J6)","v":" - "},{"$f":"IF(Teacher2!K6=\"\",\"\",Teacher2!K6)","v":" - "},{"$f":"IF(Teacher2!L6=\"\",\"\",Teacher2!L6)","v":" - "},{"$f":"IF(Teacher2!M6=\"\",\"\",Teacher2!M6)","v":" - "}]
[{"$f":"IF(Teacher1!A7=\"\",\"\",Teacher1!A7)","v":"จันทร์"},{"$f":"IF(Teacher1!B7=\"\",\"\",Teacher1!B7)","v":""},{"$f":"IF(Teacher1!C7=\"\",\"\",Teacher1!C7)","v":"ค11101"},{"$f":"IF(Teacher1!D7=\"\",\"\",Teacher1!D7)","v":"ท11101"},{"$f":"IF(Teacher1!E7=\"\",\"\",Teacher1!E7)","v":"ศ11101-2"},{"$f":"IF(Teacher1!F7=\"\",\"\",Teacher1!F7)","v":""},{"$f":"IF(Teacher1!G7=\"\",\"\",Teacher1!G7)","v":"ง11101-1"},{"$f":"IF(Teacher1!H7=\"\",\"\",Teacher1!H7)","v":""},{"$f":"IF(Teacher1!I7=\"\",\"\",Teacher1!I7)","v":""},{"$f":"IF(Teacher1!J7=\"\",\"\",Teacher1!J7)","v":""},{"$f":"IF(Teacher1!K7=\"\",\"\",Teacher1!K7)","v":""},{"$f":"IF(Teacher1!L7=\"\",\"\",Teacher1!L7)","v":""},{"$f":"IF(Teacher1!M7=\"\",\"\",Teacher1!M7)","v":""},null,{"$f":"IF(Teacher2!A7=\"\",\"\",Teacher2!A7)","v":"จันทร์"},{"$f":"IF(Teacher2!B7=\"\",\"\",Teacher2!B7)","v":""},{"$f":"IF(Teacher2!C7=\"\",\"\",Teacher2!C7)","v":""},{"$f":"IF(Teacher2!D7=\"\",\"\",Teacher2!D7)","v":""},{"$f":"IF(Teacher2!E7=\"\",\"\",Teacher2!E7)","v":"ศ12101-2"},{"$f":"IF(Teacher2!F7=\"\",\"\",Teacher2!F7)","v":""},{"$f":"IF(Teacher2!G7=\"\",\"\",Teacher2!G7)","v":"ท12101"},{"$f":"IF(Teacher2!H7=\"\",\"\",Teacher2!H7)","v":"พ12101-1"},{"$f":"IF(Teacher2!I7=\"\",\"\",Teacher2!I7)","v":""},{"$f":"IF(Teacher2!J7=\"\",\"\",Teacher2!J7)","v":""},{"$f":"IF(Teacher2!K7=\"\",\"\",Teacher2!K7)","v":""},{"$f":"IF(Teacher2!L7=\"\",\"\",Teacher2!L7)","v":""},{"$f":"IF(Teacher2!M7=\"\",\"\",Teacher2!M7)","v":""}]
[null,{"$f":"IF(Teacher1!B8=\"\",\"\",Teacher1!B8)","v":"หน้าเสาธง"},{"$f":"IF(Teacher1!C8=\"\",\"\",Teacher1!C8)","v":"คณิต1"},{"$f":"IF(Teacher1!D8=\"\",\"\",Teacher1!D8)","v":"ไทย1"},{"$f":"IF(Teacher1!E8=\"\",\"\",Teacher1!E8)","v":"ดนตรี1"},{"$f":"IF(Teacher1!F8=\"\",\"\",Teacher1!F8)","v":"พักกลางวัน"},{"$f":"IF(Teacher1!G8=\"\",\"\",Teacher1!G8)","v":"กอท1"},{"$f":"IF(Teacher1!H8=\"\",\"\",Teacher1!H8)","v":""},{"$f":"IF(Teacher1!I8=\"\",\"\",Teacher1!I8)","v":""},{"$f":"IF(Teacher1!J8=\"\",\"\",Teacher1!J8)","v":""},{"$f":"IF(Teacher1!K8=\"\",\"\",Teacher1!K8)","v":""},{"$f":"IF(Teacher1!L8=\"\",\"\",Teacher1!L8)","v":""},{"$f":"IF(Teacher1!M8=\"\",\"\",Teacher1!M8)","v":""},null,null,{"$f":"IF(Teacher2!B8=\"\",\"\",Teacher2!B8)","v":"หน้าเสาธง"},{"$f":"IF(Teacher2!C8=\"\",\"\",Teacher2!C8)","v":""},{"$f":"IF(Teacher2!D8=\"\",\"\",Teacher2!D8)","v":""},{"$f":"IF(Teacher2!E8=\"\",\"\",Teacher2!E8)","v":"ดนตรี2"},{"$f":"IF(Teacher2!F8=\"\",\"\",Teacher2!F8)","v":"พักกลางวัน"},{"$f":"IF(Teacher2!G8=\"\",\"\",Teacher2!G8)","v":"ไทย2"},{"$f":"IF(Teacher2!H8=\"\",\"\",Teacher2!H8)","v":"สุขะ2"},{"$f":"IF(Teacher2!I8=\"\",\"\",Teacher2!I8)","v":""},{"$f":"IF(Teacher2!J8=\"\",\"\",Teacher2!J8)","v":""},{"$f":"IF(Teacher2!K8=\"\",\"\",Teacher2!K8)","v":""},{"$f":"IF(Teacher2!L8=\"\",\"\",Teacher2!L8)","v":""},{"$f":"IF(Teacher2!M8=\"\",\"\",Teacher2!M8)","v":""}]
[null,{"$f":"IF(Teacher1!B9=\"\",\"\",Teacher1!B9)","v":""},{"$f":"IF(Teacher1!C9=\"\",\"\",Teacher1!C9)","v":"ป.1/1"},{"$f":"IF(Teacher1!D9=\"\",\"\",Teacher1!D9)","v":"ป.1/1"},{"$f":"IF(Teacher1!E9=\"\",\"\",Teacher1!E9)","v":"ป.1/1"},{"$f":"IF(Teacher1!F9=\"\",\"\",Teacher1!F9)","v":""},{"$f":"IF(Teacher1!G9=\"\",\"\",Teacher1!G9)","v":"ป.1/1"},{"$f":"IF(Teacher1!H9=\"\",\"\",Teacher1!H9)","v":""},{"$f":"IF(Teacher1!I9=\"\",\"\",Teacher1!I9)","v":""},{"$f":"IF(Teacher1!J9=\"\",\"\",Teacher1!J9)","v":""},{"$f":"IF(Teacher1!K9=\"\",\"\",Teacher1!K9)","v":""},{"$f":"IF(Teacher1!L9=\"\",\"\",Teacher1!L9)","v":""},{"$f":"IF(Teacher1!M9=\"\",\"\",Teacher1!M9)","v":""},null,null,{"$f":"IF(Teacher2!B9=\"\",\"\",Teacher2!B9)","v":""},{"$f":"IF(Teacher2!C9=\"\",\"\",Teacher2!C9)","v":""},{"$f":"IF(Teacher2!D9=\"\",\"\",Teacher2!D9)","v":""},{"$f":"IF(Teacher2!E9=\"\",\"\",Teacher2!E9)","v":"ป.2/1"},{"$f":"IF(Teacher2!F9=\"\",\"\",Teacher2!F9)","v":""},{"$f":"IF(Teacher2!G9=\"\",\"\",Teacher2!G9)","v":"ป.2/1"},{"$f":"IF(Teacher2!H9=\"\",\"\",Teacher2!H9)","v":"ป.2/1"},{"$f":"IF(Teacher2!I9=\"\",\"\",Teacher2!I9)","v":""},{"$f":"IF(Teacher2!J9=\"\",\"\",Teacher2!J9)","v":""},{"$f":"IF(Teacher2!K9=\"\",\"\",Teacher2!K9)","v":""},{"$f":"IF(Teacher2!L9=\"\",\"\",Teacher2!L9)","v":""},{"$f":"IF(Teacher2!M9=\"\",\"\",Teacher2!M9)","v":""}]
[{"$f":"IF(Teacher1!A10=\"\",\"\",Teacher1!A10)","v":"อังคาร"},{"$f":"IF(Teacher1!B10=\"\",\"\",Teacher1!B10)","v":""},{"$f":"IF(Teacher1!C10=\"\",\"\",Teacher1!C10)","v":"ท11101"},{"$f":"IF(Teacher1!D10=\"\",\"\",Teacher1!D10)","v":"ค11101"},{"$f":"IF(Teacher1!E10=\"\",\"\",Teacher1!E10)","v":"ส11102"},{"$f":"IF(Teacher1!F10=\"\",\"\",Teacher1!F10)","v":""},{"$f":"IF(Teacher1!G10=\"\",\"\",Teacher1!G10)","v":"ศ11101-1"},{"$f":"IF(Teacher1!H10=\"\",\"\",Teacher1!H10)","v":"ก11901"},{"$f":"IF(Teacher1!I10=\"\",\"\",Teacher1!I10)","v":"ก11906"},{"$f":"IF(Teacher1!J10=\"\",\"\",Teacher1!J10)","v":""},{"$f":"IF(Teacher1!K10=\"\",\"\",Teacher1!K10)","v":""},{"$f":"IF(Teacher1!L10=\"\",\"\",Teacher1!L10)","v":""},{"$f":"IF(Teacher1!M10=\"\",\"\",Teacher1!M10)","v":""},null,{"$f":"IF(Teacher2!A10=\"\",\"\",Teacher2!A10)","v":"อังคาร"},{"$f":"IF(Teacher2!B10=\"\",\"\",Teacher2!B10)","v":""},{"$f":"IF(Teacher2!C10=\"\",\"\",Teacher2!C10)","v":""},{"$f":"IF(Teacher2!D10=\"\",\"\",Teacher2!D10)","v":"ท12101"},{"$f":"IF(Teacher2!E10=\"\",\"\",Teacher2!E10)","v":""},{"$f":"IF(Teacher2!F10=\"\",\"\",Teacher2!F10)","v":""},{"$f":"IF(Teacher2!G10=\"\",\"\",Teacher2!G10)","v":""},{"$f":"IF(Teacher2!H10=\"\",\"\",Teacher2!H10)","v":"ก12901"},{"$f":"IF(Teacher2!I10=\"\",\"\",Teacher2!I10)","v":""},{"$f":"IF(Teacher2!J10=\"\",\"\",Teacher2!J10)","v":""},{"$f":"IF(Teacher2!K10=\"\",\"\",Teacher2!K10)","v":""},{"$f":"IF(Teacher2!L10=\"\",\"\",Teacher2!L10)","v":""},{"$f":"IF(Teacher2!M10=\"\",\"\",Teacher2!M10)","v":""}]
[null,{"$f":"IF(Teacher1!B11=\"\",\"\",Teacher1!B11)","v":"หน้าเสาธง"},{"$f":"IF(Teacher1!C11=\"\",\"\",Teacher1!C11)","v":"ไทย1"},{"$f":"IF(Teacher1!D11=\"\",\"\",Teacher1!D11)","v":"คณิต1"},{"$f":"IF(Teacher1!E11=\"\",\"\",Teacher1!E11)","v":"ประวัติ1"},{"$f":"IF(Teacher1!F11=\"\",\"\",Teacher1!F11)","v":"พักกลางวัน"},{"$f":"IF(Teacher1!G11=\"\",\"\",Teacher1!G11)","v":"ศิลปะ1"},{"$f":"IF(Teacher1!H11=\"\",\"\",Teacher1!H11)","v":"แนะแนว1"},{"$f":"IF(Teacher1!I11=\"\",\"\",Teacher1!I11)","v":"ลดเวลาเรียน"},{"$f":"IF(Teacher1!J11=\"\",\"\",Teacher1!J11)","v":""},{"$f":"IF(Teacher1!K11=\"\",\"\",Teacher1!K11)","v":""},{"$f":"IF(Teacher1!L11=\"\",\"\",Teacher1!L11)","v":""},{"$f":"IF(Teacher1!M11=\"\",\"\",Teacher1!M11)","v":""},null,null,{"$f":"IF(Teacher2!B11=\"\",\"\",Teacher2!B11)","v":"หน้าเสาธง"},{"$f":"IF(Teacher2!C11=\"\",\"\",Teacher2!C11)","v":""},{"$f":"IF(Teacher2!D11=\"\",\"\",Teacher2!D11)","v":"ไทย2"},{"$f":"IF(Teacher2!E11=\"\",\"\",Teacher2!E11)","v":""},{"$f":"IF(Teacher2!F11=\"\",\"\",Teacher2!F11)","v":"พักกลางวัน"},{"$f":"IF(Teacher2!G11=\"\",\"\",Teacher2!G11)","v":""},{"$f":"IF(Teacher2!H11=\"\",\"\",Teacher2!H11)","v":"แนะแนว2"},{"$f":"IF(Teacher2!I11=\"\",\"\",Teacher2!I11)","v":""},{"$f":"IF(Teacher2!J11=\"\",\"\",Teacher2!J11)","v":""},{"$f":"IF(Teacher2!K11=\"\",\"\",Teacher2!K11)","v":""},{"$f":"IF(Teacher2!L11=\"\",\"\",Teacher2!L11)","v":""},{"$f":"IF(Teacher2!M11=\"\",\"\",Teacher2!M11)","v":""}]
[null,{"$f":"IF(Teacher1!B12=\"\",\"\",Teacher1!B12)","v":""},{"$f":"IF(Teacher1!C12=\"\",\"\",Teacher1!C12)","v":"ป.1/1"},{"$f":"IF(Teacher1!D12=\"\",\"\",Teacher1!D12)","v":"ป.1/1"},{"$f":"IF(Teacher1!E12=\"\",\"\",Teacher1!E12)","v":"ป.1/1"},{"$f":"IF(Teacher1!F12=\"\",\"\",Teacher1!F12)","v":""},{"$f":"IF(Teacher1!G12=\"\",\"\",Teacher1!G12)","v":"ป.1/1"},{"$f":"IF(Teacher1!H12=\"\",\"\",Teacher1!H12)","v":"ป.1/1"},{"$f":"IF(Teacher1!I12=\"\",\"\",Teacher1!I12)","v":"ป.1/1"},{"$f":"IF(Teacher1!J12=\"\",\"\",Teacher1!J12)","v":""},{"$f":"IF(Teacher1!K12=\"\",\"\",Teacher1!K12)","v":""},{"$f":"IF(Teacher1!L12=\"\",\"\",Teacher1!L12)","v":""},{"$f":"IF(Teacher1!M12=\"\",\"\",Teacher1!M12)","v":""},null,null,{"$f":"IF(Teacher2!B12=\"\",\"\",Teacher2!B12)","v":""},{"$f":"IF(Teacher2!C12=\"\",\"\",Teacher2!C12)","v":""},{"$f":"IF(Teacher2!D12=\"\",\"\",Teacher2!D12)","v":"ป.2/1"},{"$f":"IF(Teacher2!E12=\"\",\"\",Teacher2!E12)","v":""},{"$f":"IF(Teacher2!F12=\"\",\"\",Teacher2!F12)","v":""},{"$f":"IF(Teacher2!G12=\"\",\"\",Teacher2!G12)","v":""},{"$f":"IF(Teacher2!H12=\"\",\"\",Teacher2!H12)","v":"ป.2/1"},{"$f":"IF(Teacher2!I12=\"\",\"\",Teacher2!I12)","v":""},{"$f":"IF(Teacher2!J12=\"\",\"\",Teacher2!J12)","v":""},{"$f":"IF(Teacher2!K12=\"\",\"\",Teacher2!K12)","v":""},{"$f":"IF(Teacher2!L12=\"\",\"\",Teacher2!L12)","v":""},{"$f":"IF(Teacher2!M12=\"\",\"\",Teacher2!M12)","v":""}]
[{"$f":"IF(Teacher1!A13=\"\",\"\",Teacher1!A13)","v":"พุธ"},{"$f":"IF(Teacher1!B13=\"\",\"\",Teacher1!B13)","v":""},{"$f":"IF(Teacher1!C13=\"\",\"\",Teacher1!C13)","v":"ท11101"},{"$f":"IF(Teacher1!D13=\"\",\"\",Teacher1!D13)","v":"ส11101"},{"$f":"IF(Teacher1!E13=\"\",\"\",Teacher1!E13)","v":"ค11101"},{"$f":"IF(Teacher1!F13=\"\",\"\",Teacher1!F13)","v":""},{"$f":"IF(Teacher1!G13=\"\",\"\",Teacher1!G13)","v":"พ11101-1"},{"$f":"IF(Teacher1!H13=\"\",\"\",Teacher1!H13)","v":"ก11902"},{"$f":"IF(Teacher1!I13=\"\",\"\",Teacher1!I13)","v":"ก11906"},{"$f":"IF(Teacher1!J13=\"\",\"\",Teacher1!J13)","v":""},{"$f":"IF(Teacher1!K13=\"\",\"\",Teacher1!K13)","v":""},{"$f":"IF(Teacher1!L13=\"\",\"\",Teacher1!L13)","v":""},{"$f":"IF(Teacher1!M13=\"\",\"\",Teacher1!M13)","v":""},null,{"$f":"IF(Teacher2!A13=\"\",\"\",Teacher2!A13)","v":"พุธ"},{"$f":"IF(Teacher2!B13=\"\",\"\",Teacher2!B13)","v":""},{"$f":"IF(Teacher2!C13=\"\",\"\",Teacher2!C13)","v":""},{"$f":"IF(Teacher2!D13=\"\",\"\",Teacher2!D13)","v":""},{"$f":"IF(Teacher2!E13=\"\",\"\",Teacher2!E13)","v":"ท12101"},{"$f":"IF(Teacher2!F13=\"\",\"\",Teacher2!F13)","v":""},{"$f":"IF(Teacher2!G13=\"\",\"\",Teacher2!G13)","v":"ส12101"},{"$f":"IF(Teacher2!H13=\"\",\"\",Teacher2!H13)","v":"ก12902"},{"$f":"IF(Teacher2!I13=\"\",\"\",Teacher2!I13)","v":""},{"$f":"IF(Teacher2!J13=\"\",\"\",Teacher2!J13)","v":""},{"$f":"IF(Teacher2!K13=\"\",\"\",Teacher2!K13)","v":""},{"$f":"IF(Teacher2!L13=\"\",\"\",Teacher2!L13)","v":""},{"$f":"IF(Teacher2!M13=\"\",\"\",Teacher2!M13)","v":""}]
[null,{"$f":"IF(Teacher1!B14=\"\",\"\",Teacher1!B14)","v":"หน้าเสาธง"},{"$f":"IF(Teacher1!C14=\"\",\"\",Teacher1!C14)","v":"ไทย1"},{"$f":"IF(Teacher1!D14=\"\",\"\",Teacher1!D14)","v":"สังคม1"},{"$f":"IF(Teacher1!E14=\"\",\"\",Teacher1!E14)","v":"คณิต1"},{"$f":"IF(Teacher1!F14=\"\",\"\",Teacher1!F14)","v":"พักกลางวัน"},{"$f":"IF(Teacher1!G14=\"\",\"\",Teacher1!G14)","v":"สุขะ1"},{"$f":"IF(Teacher1!H14=\"\",\"\",Teacher1!H14)","v":"ลูกเสือ1"},{"$f":"IF(Teacher1!I14=\"\",\"\",Teacher1!I14)","v":"ลดเวลาเรียน"},{"$f":"IF(Teacher1!J14=\"\",\"\",Teacher1!J14)","v":""},{"$f":"IF(Teacher1!K14=\"\",\"\",Teacher1!K14)","v":""},{"$f":"IF(Teacher1!L14=\"\",\"\",Teacher1!L14)","v":""},{"$f":"IF(Teacher1!M14=\"\",\"\",Teacher1!M14)","v":""},null,null,{"$f":"IF(Teacher2!B14=\"\",\"\",Teacher2!B14)","v":"หน้าเสาธง"},{"$f":"IF(Teacher2!C14=\"\",\"\",Teacher2!C14)","v":""},{"$f":"IF(Teacher2!D14=\"\",\"\",Teacher2!D14)","v":""},{"$f":"IF(Teacher2!E14=\"\",\"\",Teacher2!E14)","v":"ไทย2"},{"$f":"IF(Teacher2!F14=\"\",\"\",Teacher2!F14)","v":"พักกลางวัน"},{"$f":"IF(Teacher2!G14=\"\",\"\",Teacher2!G14)","v":"สังคม2"},{"$f":"IF(Teacher2!H14=\"\",\"\",Teacher2!H14)","v":"ลูกเสือ2"},{"$f":"IF(Teacher2!I14=\"\",\"\",Teacher2!I14)","v":""},{"$f":"IF(Teacher2!J14=\"\",\"\",Teacher2!J14)","v":""},{"$f":"IF(Teacher2!K14=\"\",\"\",Teacher2!K14)","v":""},{"$f":"IF(Teacher2!L14=\"\",\"\",Teacher2!L14)","v":""},{"$f":"IF(Teacher2!M14=\"\",\"\",Teacher2!M14)","v":""}]
[null,{"$f":"IF(Teacher1!B15=\"\",\"\",Teacher1!B15)","v":""},{"$f":"IF(Teacher1!C15=\"\",\"\",Teacher1!C15)","v":"ป.1/1"},{"$f":"IF(Teacher1!D15=\"\",\"\",Teacher1!D15)","v":"ป.1/1"},{"$f":"IF(Teacher1!E15=\"\",\"\",Teacher1!E15)","v":"ป.1/1"},{"$f":"IF(Teacher1!F15=\"\",\"\",Teacher1!F15)","v":""},{"$f":"IF(Teacher1!G15=\"\",\"\",Teacher1!G15)","v":"ป.1/1"},{"$f":"IF(Teacher1!H15=\"\",\"\",Teacher1!H15)","v":"ป.1/1"},{"$f":"IF(Teacher1!I15=\"\",\"\",Teacher1!I15)","v":"ป.1/1"},{"$f":"IF(Teacher1!J15=\"\",\"\",Teacher1!J15)","v":""},{"$f":"IF(Teacher1!K15=\"\",\"\",Teacher1!K15)","v":""},{"$f":"IF(Teacher1!L15=\"\",\"\",Teacher1!L15)","v":""},{"$f":"IF(Teacher1!M15=\"\",\"\",Teacher1!M15)","v":""},null,null,{"$f":"IF(Teacher2!B15=\"\",\"\",Teacher2!B15)","v":""},{"$f":"IF(Teacher2!C15=\"\",\"\",Teacher2!C15)","v":""},{"$f":"IF(Teacher2!D15=\"\",\"\",Teacher2!D15)","v":""},{"$f":"IF(Teacher2!E15=\"\",\"\",Teacher2!E15)","v":"ป.2/1"},{"$f":"IF(Teacher2!F15=\"\",\"\",Teacher2!F15)","v":""},{"$f":"IF(Teacher2!G15=\"\",\"\",Teacher2!G15)","v":"ป.2/1"},{"$f":"IF(Teacher2!H15=\"\",\"\",Teacher2!H15)","v":"ป.2/1"},{"$f":"IF(Teacher2!I15=\"\",\"\",Teacher2!I15)","v":""},{"$f":"IF(Teacher2!J15=\"\",\"\",Teacher2!J15)","v":""},{"$f":"IF(Teacher2!K15=\"\",\"\",Teacher2!K15)","v":""},{"$f":"IF(Teacher2!L15=\"\",\"\",Teacher2!L15)","v":""},{"$f":"IF(Teacher2!M15=\"\",\"\",Teacher2!M15)","v":""}]
[{"$f":"IF(Teacher1!A16=\"\",\"\",Teacher1!A16)","v":"พฤหัสบดี"},{"$f":"IF(Teacher1!B16=\"\",\"\",Teacher1!B16)","v":""},{"$f":"IF(Teacher1!C16=\"\",\"\",Teacher1!C16)","v":""},{"$f":"IF(Teacher1!D16=\"\",\"\",Teacher1!D16)","v":"ค11101"},{"$f":"IF(Teacher1!E16=\"\",\"\",Teacher1!E16)","v":"ท11101"},{"$f":"IF(Teacher1!F16=\"\",\"\",Teacher1!F16)","v":""},{"$f":"IF(Teacher1!G16=\"\",\"\",Teacher1!G16)","v":""},{"$f":"IF(Teacher1!H16=\"\",\"\",Teacher1!H16)","v":"พ11101-2"},{"$f":"IF(Teacher1!I16=\"\",\"\",Teacher1!I16)","v":"ก11906"},{"$f":"IF(Teacher1!J16=\"\",\"\",Teacher1!J16)","v":""},{"$f":"IF(Teacher1!K16=\"\",\"\",Teacher1!K16)","v":""},{"$f":"IF(Teacher1!L16=\"\",\"\",Teacher1!L16)","v":""},{"$f":"IF(Teacher1!M16=\"\",\"\",Teacher1!M16)","v":""},null,{"$f":"IF(Teacher2!A16=\"\",\"\",Teacher2!A16)","v":"พฤหัสบดี"},{"$f":"IF(Teacher2!B16=\"\",\"\",Teacher2!B16)","v":""},{"$f":"IF(Teacher2!C16=\"\",\"\",Teacher2!C16)","v":""},{"$f":"IF(Teacher2!D16=\"\",\"\",Teacher2!D16)","v":"ท12101"},{"$f":"IF(Teacher2!E16=\"\",\"\",Teacher2!E16)","v":"ส12101"},{"$f":"IF(Teacher2!F16=\"\",\"\",Teacher2!F16)","v":""},{"$f":"IF(Teacher2!G16=\"\",\"\",Teacher2!G16)","v":"ง12101-1"},{"$f":"IF(Teacher2!H16=\"\",\"\",Teacher2!H16)","v":"พ12101-2"},{"$f":"IF(Teacher2!I16=\"\",\"\",Teacher2!I16)","v":""},{"$f":"IF(Teacher2!J16=\"\",\"\",Teacher2!J16)","v":""},{"$f":"IF(Teacher2!K16=\"\",\"\",Teacher2!K16)","v":""},{"$f":"IF(Teacher2!L16=\"\",\"\",Teacher2!L16)","v":""},{"$f":"IF(Teacher2!M16=\"\",\"\",Teacher2!M16)","v":""}]
[null,{"$f":"IF(Teacher1!B17=\"\",\"\",Teacher1!B17)","v":"หน้าเสาธง"},{"$f":"IF(Teacher1!C17=\"\",\"\",Teacher1!C17)","v":""},{"$f":"IF(Teacher1!D17=\"\",\"\",Teacher1!D17)","v":"คณิต1"},{"$f":"IF(Teacher1!E17=\"\",\"\",Teacher1!E17)","v":"ไทย1"},{"$f":"IF(Teacher1!F17=\"\",\"\",Teacher1!F17)","v":"พักกลางวัน"},{"$f":"IF(Teacher1!G17=\"\",\"\",Teacher1!G17)","v":""},{"$f":"IF(Teacher1!H17=\"\",\"\",Teacher1!H17)","v":"พละ1"},{"$f":"IF(Teacher1!I17=\"\",\"\",Teacher1!I17)","v":"ลดเวลาเรียน"},{"$f":"IF(Teacher1!J17=\"\",\"\",Teacher1!J17)","v":""},{"$f":"IF(Teacher1!K17=\"\",\"\",Teacher1!K17)","v":""},{"$f":"IF(Teacher1!L17=\"\",\"\",Teacher1!L17)","v":""},{"$f":"IF(Teacher1!M17=\"\",\"\",Teacher1!M17)","v":""},null,null,{"$f":"IF(Teacher2!B17=\"\",\"\",Teacher2!B17)","v":"หน้าเสาธง"},{"$f":"IF(Teacher2!C17=\"\",\"\",Teacher2!C17)","v":""},{"$f":"IF(Teacher2!D17=\"\",\"\",Teacher2!D17)","v":"ไทย2"},{"$f":"IF(Teacher2!E17=\"\",\"\",Teacher2!E17)","v":"สังคม2"},{"$f":"IF(Teacher2!F17=\"\",\"\",Teacher2!F17)","v":"พักกลางวัน"},{"$f":"IF(Teacher2!G17=\"\",\"\",Teacher2!G17)","v":"กอท2"},{"$f":"IF(Teacher2!H17=\"\",\"\",Teacher2!H17)","v":"พละ2"},{"$f":"IF(Teacher2!I17=\"\",\"\",Teacher2!I17)","v":""},{"$f":"IF(Teacher2!J17=\"\",\"\",Teacher2!J17)","v":""},{"$f":"IF(Teacher2!K17=\"\",\"\",Teacher2!K17)","v":""},{"$f":"IF(Teacher2!L17=\"\",\"\",Teacher2!L17)","v":""},{"$f":"IF(Teacher2!M17=\"\",\"\",Teacher2!M17)","v":""}]
[null,{"$f":"IF(Teacher1!B18=\"\",\"\",Teacher1!B18)","v":""},{"$f":"IF(Teacher1!C18=\"\",\"\",Teacher1!C18)","v":""},{"$f":"IF(Teacher1!D18=\"\",\"\",Teacher1!D18)","v":"ป.1/1"},{"$f":"IF(Teacher1!E18=\"\",\"\",Teacher1!E18)","v":"ป.1/1"},{"$f":"IF(Teacher1!F18=\"\",\"\",Teacher1!F18)","v":""},{"$f":"IF(Teacher1!G18=\"\",\"\",Teacher1!G18)","v":""},{"$f":"IF(Teacher1!H18=\"\",\"\",Teacher1!H18)","v":"ป.1/1"},{"$f":"IF(Teacher1!I18=\"\",\"\",Teacher1!I18)","v":"ป.1/1"},{"$f":"IF(Teacher1!J18=\"\",\"\",Teacher1!J18)","v":""},{"$f":"IF(Teacher1!K18=\"\",\"\",Teacher1!K18)","v":""},{"$f":"IF(Teacher1!L18=\"\",\"\",Teacher1!L18)","v":""},{"$f":"IF(Teacher1!M18=\"\",\"\",Teacher1!M18)","v":""},null,null,{"$f":"IF(Teacher2!B18=\"\",\"\",Teacher2!B18)","v":""},{"$f":"IF(Teacher2!C18=\"\",\"\",Teacher2!C18)","v":""},{"$f":"IF(Teacher2!D18=\"\",\"\",Teacher2!D18)","v":"ป.2/1"},{"$f":"IF(Teacher2!E18=\"\",\"\",Teacher2!E18)","v":"ป.2/1"},{"$f":"IF(Teacher2!F18=\"\",\"\",Teacher2!F18)","v":""},{"$f":"IF(Teacher2!G18=\"\",\"\",Teacher2!G18)","v":"ป.2/1"},{"$f":"IF(Teacher2!H18=\"\",\"\",Teacher2!H18)","v":"ป.2/1"},{"$f":"IF(Teacher2!I18=\"\",\"\",Teacher2!I18)","v":""},{"$f":"IF(Teacher2!J18=\"\",\"\",Teacher2!J18)","v":""},{"$f":"IF(Teacher2!K18=\"\",\"\",Teacher2!K18)","v":""},{"$f":"IF(Teacher2!L18=\"\",\"\",Teacher2!L18)","v":""},{"$f":"IF(Teacher2!M18=\"\",\"\",Teacher2!M18)","v":""}]
[{"$f":"IF(Teacher1!A19=\"\",\"\",Teacher1!A19)","v":"ศุกร์"},{"$f":"IF(Teacher1!B19=\"\",\"\",Teacher1!B19)","v":""},{"$f":"IF(Teacher1!C19=\"\",\"\",Teacher1!C19)","v":"ค11101"},{"$f":"IF(Teacher1!D19=\"\",\"\",Teacher1!D19)","v":"ท11101"},{"$f":"IF(Teacher1!E19=\"\",\"\",Teacher1!E19)","v":""},{"$f":"IF(Teacher1!F19=\"\",\"\",Teacher1!F19)","v":""},{"$f":"IF(Teacher1!G19=\"\",\"\",Teacher1!G19)","v":"ส11101"},{"$f":"IF(Teacher1!H19=\"\",\"\",Teacher1!H19)","v":"ก11903"},{"$f":"IF(Teacher1!I19=\"\",\"\",Teacher1!I19)","v":"ก11906"},{"$f":"IF(Teacher1!J19=\"\",\"\",Teacher1!J19)","v":""},{"$f":"IF(Teacher1!K19=\"\",\"\",Teacher1!K19)","v":""},{"$f":"IF(Teacher1!L19=\"\",\"\",Teacher1!L19)","v":""},{"$f":"IF(Teacher1!M19=\"\",\"\",Teacher1!M19)","v":""},null,{"$f":"IF(Teacher2!A19=\"\",\"\",Teacher2!A19)","v":"ศุกร์"},{"$f":"IF(Teacher2!B19=\"\",\"\",Teacher2!B19)","v":""},{"$f":"IF(Teacher2!C19=\"\",\"\",Teacher2!C19)","v":"ท12101"},{"$f":"IF(Teacher2!D19=\"\",\"\",Teacher2!D19)","v":""},{"$f":"IF(Teacher2!E19=\"\",\"\",Teacher2!E19)","v":"ส12102"},{"$f":"IF(Teacher2!F19=\"\",\"\",Teacher2!F19)","v":""},{"$f":"IF(Teacher2!G19=\"\",\"\",Teacher2!G19)","v":"ศ12101-1"},{"$f":"IF(Teacher2!H19=\"\",\"\",Teacher2!H19)","v":"ก12903"},{"$f":"IF(Teacher2!I19=\"\",\"\",Teacher2!I19)","v":""},{"$f":"IF(Teacher2!J19=\"\",\"\",Teacher2!J19)","v":""},{"$f":"IF(Teacher2!K19=\"\",\"\",Teacher2!K19)","v":""},{"$f":"IF(Teacher2!L19=\"\",\"\",Teacher2!L19)","v":""},{"$f":"IF(Teacher2!M19=\"\",\"\",Teacher2!M19)","v":""}]
[null,{"$f":"IF(Teacher1!B20=\"\",\"\",Teacher1!B20)","v":"หน้าเสาธง"},{"$f":"IF(Teacher1!C20=\"\",\"\",Teacher1!C20)","v":"คณิต1"},{"$f":"IF(Teacher1!D20=\"\",\"\",Teacher1!D20)","v":"ไทย1"},{"$f":"IF(Teacher1!E20=\"\",\"\",Teacher1!E20)","v":""},{"$f":"IF(Teacher1!F20=\"\",\"\",Teacher1!F20)","v":"พักกลางวัน"},{"$f":"IF(Teacher1!G20=\"\",\"\",Teacher1!G20)","v":"สังคม1"},{"$f":"IF(Teacher1!H20=\"\",\"\",Teacher1!H20)","v":"ชุมนุม1"},{"$f":"IF(Teacher1!I20=\"\",\"\",Teacher1!I20)","v":"ลดเวลาเรียน"},{"$f":"IF(Teacher1!J20=\"\",\"\",Teacher1!J20)","v":""},{"$f":"IF(Teacher1!K20=\"\",\"\",Teacher1!K20)","v":""},{"$f":"IF(Teacher1!L20=\"\",\"\",Teacher1!L20)","v":""},{"$f":"IF(Teacher1!M20=\"\",\"\",Teacher1!M20)","v":""},null,null,{"$f":"IF(Teacher2!B20=\"\",\"\",Teacher2!B20)","v":"หน้าเสาธง"},{"$f":"IF(Teacher2!C20=\"\",\"\",Teacher2!C20)","v":"ไทย2"},{"$f":"IF(Teacher2!D20=\"\",\"\",Teacher2!D20)","v":""},{"$f":"IF(Teacher2!E20=\"\",\"\",Teacher2!E20)","v":"ประวัติ2"},{"$f":"IF(Teacher2!F20=\"\",\"\",Teacher2!F20)","v":"พักกลางวัน"},{"$f":"IF(Teacher2!G20=\"\",\"\",Teacher2!G20)","v":"ศิลปะ2"},{"$f":"IF(Teacher2!H20=\"\",\"\",Teacher2!H20)","v":"ชุมนุม2"},{"$f":"IF(Teacher2!I20=\"\",\"\",Teacher2!I20)","v":""},{"$f":"IF(Teacher2!J20=\"\",\"\",Teacher2!J20)","v":""},{"$f":"IF(Teacher2!K20=\"\",\"\",Teacher2!K20)","v":""},{"$f":"IF(Teacher2!L20=\"\",\"\",Teacher2!L20)","v":""},{"$f":"IF(Teacher2!M20=\"\",\"\",Teacher2!M20)","v":""}]
[null,{"$f":"IF(Teacher1!B21=\"\",\"\",Teacher1!B21)","v":""},{"$f":"IF(Teacher1!C21=\"\",\"\",Teacher1!C21)","v":"ป.1/1"},{"$f":"IF(Teacher1!D21=\"\",\"\",Teacher1!D21)","v":"ป.1/1"},{"$f":"IF(Teacher1!E21=\"\",\"\",Teacher1!E21)","v":""},{"$f":"IF(Teacher1!F21=\"\",\"\",Teacher1!F21)","v":""},{"$f":"IF(Teacher1!G21=\"\",\"\",Teacher1!G21)","v":"ป.1/1"},{"$f":"IF(Teacher1!H21=\"\",\"\",Teacher1!H21)","v":"ป.1/1"},{"$f":"IF(Teacher1!I21=\"\",\"\",Teacher1!I21)","v":"ป.1/1"},{"$f":"IF(Teacher1!J21=\"\",\"\",Teacher1!J21)","v":""},{"$f":"IF(Teacher1!K21=\"\",\"\",Teacher1!K21)","v":""},{"$f":"IF(Teacher1!L21=\"\",\"\",Teacher1!L21)","v":""},{"$f":"IF(Teacher1!M21=\"\",\"\",Teacher1!M21)","v":""},null,null,{"$f":"IF(Teacher2!B21=\"\",\"\",Teacher2!B21)","v":""},{"$f":"IF(Teacher2!C21=\"\",\"\",Teacher2!C21)","v":"ป.2/1"},{"$f":"IF(Teacher2!D21=\"\",\"\",Teacher2!D21)","v":""},{"$f":"IF(Teacher2!E21=\"\",\"\",Teacher2!E21)","v":"ป.2/1"},{"$f":"IF(Teacher2!F21=\"\",\"\",Teacher2!F21)","v":""},{"$f":"IF(Teacher2!G21=\"\",\"\",Teacher2!G21)","v":"ป.2/1"},{"$f":"IF(Teacher2!H21=\"\",\"\",Teacher2!H21)","v":"ป.2/1"},{"$f":"IF(Teacher2!I21=\"\",\"\",Teacher2!I21)","v":""},{"$f":"IF(Teacher2!J21=\"\",\"\",Teacher2!J21)","v":""},{"$f":"IF(Teacher2!K21=\"\",\"\",Teacher2!K21)","v":""},{"$f":"IF(Teacher2!L21=\"\",\"\",Teacher2!L21)","v":""},{"$f":"IF(Teacher2!M21=\"\",\"\",Teacher2!M21)","v":""}]
[{"$f":"IF(Teacher1!A22=\"\",\"\",Teacher1!A22)","v":"เสาร์"},{"$f":"IF(Teacher1!B22=\"\",\"\",Teacher1!B22)","v":""},{"$f":"IF(Teacher1!C22=\"\",\"\",Teacher1!C22)","v":""},{"$f":"IF(Teacher1!D22=\"\",\"\",Teacher1!D22)","v":""},{"$f":"IF(Teacher1!E22=\"\",\"\",Teacher1!E22)","v":""},{"$f":"IF(Teacher1!F22=\"\",\"\",Teacher1!F22)","v":""},{"$f":"IF(Teacher1!G22=\"\",\"\",Teacher1!G22)","v":""},{"$f":"IF(Teacher1!H22=\"\",\"\",Teacher1!H22)","v":""},{"$f":"IF(Teacher1!I22=\"\",\"\",Teacher1!I22)","v":""},{"$f":"IF(Teacher1!J22=\"\",\"\",Teacher1!J22)","v":""},{"$f":"IF(Teacher1!K22=\"\",\"\",Teacher1!K22)","v":""},{"$f":"IF(Teacher1!L22=\"\",\"\",Teacher1!L22)","v":""},{"$f":"IF(Teacher1!M22=\"\",\"\",Teacher1!M22)","v":""},null,{"$f":"IF(Teacher2!A22=\"\",\"\",Teacher2!A22)","v":"เสาร์"},{"$f":"IF(Teacher2!B22=\"\",\"\",Teacher2!B22)","v":""},{"$f":"IF(Teacher2!C22=\"\",\"\",Teacher2!C22)","v":""},{"$f":"IF(Teacher2!D22=\"\",\"\",Teacher2!D22)","v":""},{"$f":"IF(Teacher2!E22=\"\",\"\",Teacher2!E22)","v":""},{"$f":"IF(Teacher2!F22=\"\",\"\",Teacher2!F22)","v":""},{"$f":"IF(Teacher2!G22=\"\",\"\",Teacher2!G22)","v":""},{"$f":"IF(Teacher2!H22=\"\",\"\",Teacher2!H22)","v":""},{"$f":"IF(Teacher2!I22=\"\",\"\",Teacher2!I22)","v":""},{"$f":"IF(Teacher2!J22=\"\",\"\",Teacher2!J22)","v":""},{"$f":"IF(Teacher2!K22=\"\",\"\",Teacher2!K22)","v":""},{"$f":"IF(Teacher2!L22=\"\",\"\",Teacher2!L22)","v":""},{"$f":"IF(Teacher2!M22=\"\",\"\",Teacher2!M22)","v":""}]
[null,{"$f":"IF(Teacher1!B23=\"\",\"\",Teacher1!B23)","v":""},{"$f":"IF(Teacher1!C23=\"\",\"\",Teacher1!C23)","v":""},{"$f":"IF(Teacher1!D23=\"\",\"\",Teacher1!D23)","v":""},{"$f":"IF(Teacher1!E23=\"\",\"\",Teacher1!E23)","v":""},{"$f":"IF(Teacher1!F23=\"\",\"\",Teacher1!F23)","v":""},{"$f":"IF(Teacher1!G23=\"\",\"\",Teacher1!G23)","v":""},{"$f":"IF(Teacher1!H23=\"\",\"\",Teacher1!H23)","v":""},{"$f":"IF(Teacher1!I23=\"\",\"\",Teacher1!I23)","v":""},{"$f":"IF(Teacher1!J23=\"\",\"\",Teacher1!J23)","v":""},{"$f":"IF(Teacher1!K23=\"\",\"\",Teacher1!K23)","v":""},{"$f":"IF(Teacher1!L23=\"\",\"\",Teacher1!L23)","v":""},{"$f":"IF(Teacher1!M23=\"\",\"\",Teacher1!M23)","v":""},null,null,{"$f":"IF(Teacher2!B23=\"\",\"\",Teacher2!B23)","v":""},{"$f":"IF(Teacher2!C23=\"\",\"\",Teacher2!C23)","v":""},{"$f":"IF(Teacher2!D23=\"\",\"\",Teacher2!D23)","v":""},{"$f":"IF(Teacher2!E23=\"\",\"\",Teacher2!E23)","v":""},{"$f":"IF(Teacher2!F23=\"\",\"\",Teacher2!F23)","v":""},{"$f":"IF(Teacher2!G23=\"\",\"\",Teacher2!G23)","v":""},{"$f":"IF(Teacher2!H23=\"\",\"\",Teacher2!H23)","v":""},{"$f":"IF(Teacher2!I23=\"\",\"\",Teacher2!I23)","v":""},{"$f":"IF(Teacher2!J23=\"\",\"\",Teacher2!J23)","v":""},{"$f":"IF(Teacher2!K23=\"\",\"\",Teacher2!K23)","v":""},{"$f":"IF(Teacher2!L23=\"\",\"\",Teacher2!L23)","v":""},{"$f":"IF(Teacher2!M23=\"\",\"\",Teacher2!M23)","v":""}]
[null,{"$f":"IF(Teacher1!B24=\"\",\"\",Teacher1!B24)","v":""},{"$f":"IF(Teacher1!C24=\"\",\"\",Teacher1!C24)","v":""},{"$f":"IF(Teacher1!D24=\"\",\"\",Teacher1!D24)","v":""},{"$f":"IF(Teacher1!E24=\"\",\"\",Teacher1!E24)","v":""},{"$f":"IF(Teacher1!F24=\"\",\"\",Teacher1!F24)","v":""},{"$f":"IF(Teacher1!G24=\"\",\"\",Teacher1!G24)","v":""},{"$f":"IF(Teacher1!H24=\"\",\"\",Teacher1!H24)","v":""},{"$f":"IF(Teacher1!I24=\"\",\"\",Teacher1!I24)","v":""},{"$f":"IF(Teacher1!J24=\"\",\"\",Teacher1!J24)","v":""},{"$f":"IF(Teacher1!K24=\"\",\"\",Teacher1!K24)","v":""},{"$f":"IF(Teacher1!L24=\"\",\"\",Teacher1!L24)","v":""},{"$f":"IF(Teacher1!M24=\"\",\"\",Teacher1!M24)","v":""},null,null,{"$f":"IF(Teacher2!B24=\"\",\"\",Teacher2!B24)","v":""},{"$f":"IF(Teacher2!C24=\"\",\"\",Teacher2!C24)","v":""},{"$f":"IF(Teacher2!D24=\"\",\"\",Teacher2!D24)","v":""},{"$f":"IF(Teacher2!E24=\"\",\"\",Teacher2!E24)","v":""},{"$f":"IF(Teacher2!F24=\"\",\"\",Teacher2!F24)","v":""},{"$f":"IF(Teacher2!G24=\"\",\"\",Teacher2!G24)","v":""},{"$f":"IF(Teacher2!H24=\"\",\"\",Teacher2!H24)","v":""},{"$f":"IF(Teacher2!I24=\"\",\"\",Teacher2!I24)","v":""},{"$f":"IF(Teacher2!J24=\"\",\"\",Teacher2!J24)","v":""},{"$f":"IF(Teacher2!K24=\"\",\"\",Teacher2!K24)","v":""},{"$f":"IF(Teacher2!L24=\"\",\"\",Teacher2!L24)","v":""},{"$f":"IF(Teacher2!M24=\"\",\"\",Teacher2!M24)","v":""}]
[{"$f":"IF(Teacher1!A25=\"\",\"\",Teacher1!A25)","v":"อาทิตย์"},{"$f":"IF(Teacher1!B25=\"\",\"\",Teacher1!B25)","v":""},{"$f":"IF(Teacher1!C25=\"\",\"\",Teacher1!C25)","v":""},{"$f":"IF(Teacher1!D25=\"\",\"\",Teacher1!D25)","v":""},{"$f":"IF(Teacher1!E25=\"\",\"\",Teacher1!E25)","v":""},{"$f":"IF(Teacher1!F25=\"\",\"\",Teacher1!F25)","v":""},{"$f":"IF(Teacher1!G25=\"\",\"\",Teacher1!G25)","v":""},{"$f":"IF(Teacher1!H25=\"\",\"\",Teacher1!H25)","v":""},{"$f":"IF(Teacher1!I25=\"\",\"\",Teacher1!I25)","v":""},{"$f":"IF(Teacher1!J25=\"\",\"\",Teacher1!J25)","v":""},{"$f":"IF(Teacher1!K25=\"\",\"\",Teacher1!K25)","v":""},{"$f":"IF(Teacher1!L25=\"\",\"\",Teacher1!L25)","v":""},{"$f":"IF(Teacher1!M25=\"\",\"\",Teacher1!M25)","v":""},null,{"$f":"IF(Teacher2!A25=\"\",\"\",Teacher2!A25)","v":"อาทิตย์"},{"$f":"IF(Teacher2!B25=\"\",\"\",Teacher2!B25)","v":""},{"$f":"IF(Teacher2!C25=\"\",\"\",Teacher2!C25)","v":""},{"$f":"IF(Teacher2!D25=\"\",\"\",Teacher2!D25)","v":""},{"$f":"IF(Teacher2!E25=\"\",\"\",Teacher2!E25)","v":""},{"$f":"IF(Teacher2!F25=\"\",\"\",Teacher2!F25)","v":""},{"$f":"IF(Teacher2!G25=\"\",\"\",Teacher2!G25)","v":""},{"$f":"IF(Teacher2!H25=\"\",\"\",Teacher2!H25)","v":""},{"$f":"IF(Teacher2!I25=\"\",\"\",Teacher2!I25)","v":""},{"$f":"IF(Teacher2!J25=\"\",\"\",Teacher2!J25)","v":""},{"$f":"IF(Teacher2!K25=\"\",\"\",Teacher2!K25)","v":""},{"$f":"IF(Teacher2!L25=\"\",\"\",Teacher2!L25)","v":""},{"$f":"IF(Teacher2!M25=\"\",\"\",Teacher2!M25)","v":""}]
[null,{"$f":"IF(Teacher1!B26=\"\",\"\",Teacher1!B26)","v":""},{"$f":"IF(Teacher1!C26=\"\",\"\",Teacher1!C26)","v":""},{"$f":"IF(Teacher1!D26=\"\",\"\",Teacher1!D26)","v":""},{"$f":"IF(Teacher1!E26=\"\",\"\",Teacher1!E26)","v":""},{"$f":"IF(Teacher1!F26=\"\",\"\",Teacher1!F26)","v":""},{"$f":"IF(Teacher1!G26=\"\",\"\",Teacher1!G26)","v":""},{"$f":"IF(Teacher1!H26=\"\",\"\",Teacher1!H26)","v":""},{"$f":"IF(Teacher1!I26=\"\",\"\",Teacher1!I26)","v":""},{"$f":"IF(Teacher1!J26=\"\",\"\",Teacher1!J26)","v":""},{"$f":"IF(Teacher1!K26=\"\",\"\",Teacher1!K26)","v":""},{"$f":"IF(Teacher1!L26=\"\",\"\",Teacher1!L26)","v":""},{"$f":"IF(Teacher1!M26=\"\",\"\",Teacher1!M26)","v":""},null,null,{"$f":"IF(Teacher2!B26=\"\",\"\",Teacher2!B26)","v":""},{"$f":"IF(Teacher2!C26=\"\",\"\",Teacher2!C26)","v":""},{"$f":"IF(Teacher2!D26=\"\",\"\",Teacher2!D26)","v":""},{"$f":"IF(Teacher2!E26=\"\",\"\",Teacher2!E26)","v":""},{"$f":"IF(Teacher2!F26=\"\",\"\",Teacher2!F26)","v":""},{"$f":"IF(Teacher2!G26=\"\",\"\",Teacher2!G26)","v":""},{"$f":"IF(Teacher2!H26=\"\",\"\",Teacher2!H26)","v":""},{"$f":"IF(Teacher2!I26=\"\",\"\",Teacher2!I26)","v":""},{"$f":"IF(Teacher2!J26=\"\",\"\",Teacher2!J26)","v":""},{"$f":"IF(Teacher2!K26=\"\",\"\",Teacher2!K26)","v":""},{"$f":"IF(Teacher2!L26=\"\",\"\",Teacher2!L26)","v":""},{"$f":"IF(Teacher2!M26=\"\",\"\",Teacher2!M26)","v":""}]
[null,{"$f":"IF(Teacher1!B27=\"\",\"\",Teacher1!B27)","v":""},{"$f":"IF(Teacher1!C27=\"\",\"\",Teacher1!C27)","v":""},{"$f":"IF(Teacher1!D27=\"\",\"\",Teacher1!D27)","v":""},{"$f":"IF(Teacher1!E27=\"\",\"\",Teacher1!E27)","v":""},{"$f":"IF(Teacher1!F27=\"\",\"\",Teacher1!F27)","v":""},{"$f":"IF(Teacher1!G27=\"\",\"\",Teacher1!G27)","v":""},{"$f":"IF(Teacher1!H27=\"\",\"\",Teacher1!H27)","v":""},{"$f":"IF(Teacher1!I27=\"\",\"\",Teacher1!I27)","v":""},{"$f":"IF(Teacher1!J27=\"\",\"\",Teacher1!J27)","v":""},{"$f":"IF(Teacher1!K27=\"\",\"\",Teacher1!K27)","v":""},{"$f":"IF(Teacher1!L27=\"\",\"\",Teacher1!L27)","v":""},{"$f":"IF(Teacher1!M27=\"\",\"\",Teacher1!M27)","v":""},null,null,{"$f":"IF(Teacher2!B27=\"\",\"\",Teacher2!B27)","v":""},{"$f":"IF(Teacher2!C27=\"\",\"\",Teacher2!C27)","v":""},{"$f":"IF(Teacher2!D27=\"\",\"\",Teacher2!D27)","v":""},{"$f":"IF(Teacher2!E27=\"\",\"\",Teacher2!E27)","v":""},{"$f":"IF(Teacher2!F27=\"\",\"\",Teacher2!F27)","v":""},{"$f":"IF(Teacher2!G27=\"\",\"\",Teacher2!G27)","v":""},{"$f":"IF(Teacher2!H27=\"\",\"\",Teacher2!H27)","v":""},{"$f":"IF(Teacher2!I27=\"\",\"\",Teacher2!I27)","v":""},{"$f":"IF(Teacher2!J27=\"\",\"\",Teacher2!J27)","v":""},{"$f":"IF(Teacher2!K27=\"\",\"\",Teacher2!K27)","v":""},{"$f":"IF(Teacher2!L27=\"\",\"\",Teacher2!L27)","v":""},{"$f":"IF(Teacher2!M27=\"\",\"\",Teacher2!M27)","v":""}]
[]
[{"$f":"IF(Teacher3!A1=\"\",\"\",Teacher3!A1)","v":"โรงเรียนบ้านน้ำสอด สำนักงานเขตพื้นที่การศึกษาประถมศึกษาน่าน เขต 2"},null,null,null,null,null,null,null,null,null,null,null,null,null,{"$f":"IF(Teacher4!A1=\"\",\"\",Teacher4!A1)","v":"โรงเรียนบ้านน้ำสอด สำนักงานเขตพื้นที่การศึกษาประถมศึกษาน่าน เขต 2"}]
[{"$f":"IF(Teacher3!A2=\"\",\"\",Teacher3!A2)","v":"ตารางสอนของ นายชัยณรงค์  ธรรมสละ  ภาคเรียนที่ 2 ปีการศึกษา 2559"},null,null,null,null,null,null,null,null,null,null,null,null,null,{"$f":"IF(Teacher4!A2=\"\",\"\",Teacher4!A2)","v":"ตารางสอนของ นายเกียรติชัย  วัดคำ  ภาคเรียนที่ 2 ปีการศึกษา 2559"}]
[]
[{"$f":"IF(Teacher3!A4=\"\",\"\",Teacher3!A4)","v":"วัน"},{"$f":"IF(Teacher3!B4=\"\",\"\",Teacher3!B4)","v":"ชั่วโมงที่"},null,null,null,null,null,null,null,null,null,null,null,null,{"$f":"IF(Teacher4!A4=\"\",\"\",Teacher4!A4)","v":"วัน"},{"$f":"IF(Teacher4!B4=\"\",\"\",Teacher4!B4)","v":"ชั่วโมงที่"},null,null,null,null,null,null,null,null,null,null,null,"ปรับขนาดตาราง"]
[null,{"$f":"IF(Teacher3!B5=\"\",\"\",Teacher3!B5)","v":1},{"$f":"IF(Teacher3!C5=\"\",\"\",Teacher3!C5)","v":2},{"$f":"IF(Teacher3!D5=\"\",\"\",Teacher3!D5)","v":3},{"$f":"IF(Teacher3!E5=\"\",\"\",Teacher3!E5)","v":4},{"$f":"IF(Teacher3!F5=\"\",\"\",Teacher3!F5)","v":5},{"$f":"IF(Teacher3!G5=\"\",\"\",Teacher3!G5)","v":6},{"$f":"IF(Teacher3!H5=\"\",\"\",Teacher3!H5)","v":7},{"$f":"IF(Teacher3!I5=\"\",\"\",Teacher3!I5)","v":8},{"$f":"IF(Teacher3!J5=\"\",\"\",Teacher3!J5)","v":9},{"$f":"IF(Teacher3!K5=\"\",\"\",Teacher3!K5)","v":10},{"$f":"IF(Teacher3!L5=\"\",\"\",Teacher3!L5)","v":11},{"$f":"IF(Teacher3!M5=\"\",\"\",Teacher3!M5)","v":12},null,null,{"$f":"IF(Teacher4!B5=\"\",\"\",Teacher4!B5)","v":1},{"$f":"IF(Teacher4!C5=\"\",\"\",Teacher4!C5)","v":2},{"$f":"IF(Teacher4!D5=\"\",\"\",Teacher4!D5)","v":3},{"$f":"IF(Teacher4!E5=\"\",\"\",Teacher4!E5)","v":4},{"$f":"IF(Teacher4!F5=\"\",\"\",Teacher4!F5)","v":5},{"$f":"IF(Teacher4!G5=\"\",\"\",Teacher4!G5)","v":6},{"$f":"IF(Teacher4!H5=\"\",\"\",Teacher4!H5)","v":7},{"$f":"IF(Teacher4!I5=\"\",\"\",Teacher4!I5)","v":8},{"$f":"IF(Teacher4!J5=\"\",\"\",Teacher4!J5)","v":9},{"$f":"IF(Teacher4!K5=\"\",\"\",Teacher4!K5)","v":10},{"$f":"IF(Teacher4!L5=\"\",\"\",Teacher4!L5)","v":11},{"$f":"IF(Teacher4!M5=\"\",\"\",Teacher4!M5)","v":12}]
[{"$f":"IF(Teacher3!A6=\"\",\"\",Teacher3!A6)","v":"เวลา"},{"$f":"IF(Teacher3!B6=\"\",\"\",Teacher3!B6)","v":"8.00 - 8.30"},{"$f":"IF(Teacher3!C6=\"\",\"\",Teacher3!C6)","v":"8.31 - 9.30"},{"$f":"IF(Teacher3!D6=\"\",\"\",Teacher3!D6)","v":"9.31 - 10.30"},{"$f":"IF(Teacher3!E6=\"\",\"\",Teacher3!E6)","v":"10.31 - 11.30"},{"$f":"IF(Teacher3!F6=\"\",\"\",Teacher3!F6)","v":"11.31 - 12.30"},{"$f":"IF(Teacher3!G6=\"\",\"\",Teacher3!G6)","v":"12.31 - 13.30"},{"$f":"IF(Teacher3!H6=\"\",\"\",Teacher3!H6)","v":"13.31 - 14.30"},{"$f":"IF(Teacher3!I6=\"\",\"\",Teacher3!I6)","v":"14.31 - 15.30"},{"$f":"IF(Teacher3!J6=\"\",\"\",Teacher3!J6)","v":" - "},{"$f":"IF(Teacher3!K6=\"\",\"\",Teacher3!K6)","v":" - "},{"$f":"IF(Teacher3!L6=\"\",\"\",Teacher3!L6)","v":" - "},{"$f":"IF(Teacher3!M6=\"\",\"\",Teacher3!M6)","v":" - "},null,{"$f":"IF(Teacher4!A6=\"\",\"\",Teacher4!A6)","v":"เวลา"},{"$f":"IF(Teacher4!B6=\"\",\"\",Teacher4!B6)","v":"8.00 - 8.30"},{"$f":"IF(Teacher4!C6=\"\",\"\",Teacher4!C6)","v":"8.31 - 9.30"},{"$f":"IF(Teacher4!D6=\"\",\"\",Teacher4!D6)","v":"9.31 - 10.30"},{"$f":"IF(Teacher4!E6=\"\",\"\",Teacher4!E6)","v":"10.31 - 11.30"},{"$f":"IF(Teacher4!F6=\"\",\"\",Teacher4!F6)","v":"11.31 - 12.30"},{"$f":"IF(Teacher4!G6=\"\",\"\",Teacher4!G6)","v":"12.31 - 13.30"},{"$f":"IF(Teacher4!H6=\"\",\"\",Teacher4!H6)","v":"13.31 - 14.30"},{"$f":"IF(Teacher4!I6=\"\",\"\",Teacher4!I6)","v":"14.31 - 15.30"},{"$f":"IF(Teacher4!J6=\"\",\"\",Teacher4!J6)","v":" - "},{"$f":"IF(Teacher4!K6=\"\",\"\",Teacher4!K6)","v":" - "},{"$f":"IF(Teacher4!L6=\"\",\"\",Teacher4!L6)","v":" - "},{"$f":"IF(Teacher4!M6=\"\",\"\",Teacher4!M6)","v":" - "}]
[{"$f":"IF(Teacher3!A7=\"\",\"\",Teacher3!A7)","v":"จันทร์"},{"$f":"IF(Teacher3!B7=\"\",\"\",Teacher3!B7)","v":""},{"$f":"IF(Teacher3!C7=\"\",\"\",Teacher3!C7)","v":"ท13101"},{"$f":"IF(Teacher3!D7=\"\",\"\",Teacher3!D7)","v":"ค13101"},{"$f":"IF(Teacher3!E7=\"\",\"\",Teacher3!E7)","v":"พ13101-1"},{"$f":"IF(Teacher3!F7=\"\",\"\",Teacher3!F7)","v":""},{"$f":"IF(Teacher3!G7=\"\",\"\",Teacher3!G7)","v":"ศ13101-2"},{"$f":"IF(Teacher3!H7=\"\",\"\",Teacher3!H7)","v":"ส13101"},{"$f":"IF(Teacher3!I7=\"\",\"\",Teacher3!I7)","v":"ก12906"},{"$f":"IF(Teacher3!J7=\"\",\"\",Teacher3!J7)","v":""},{"$f":"IF(Teacher3!K7=\"\",\"\",Teacher3!K7)","v":""},{"$f":"IF(Teacher3!L7=\"\",\"\",Teacher3!L7)","v":""},{"$f":"IF(Teacher3!M7=\"\",\"\",Teacher3!M7)","v":""},null,{"$f":"IF(Teacher4!A7=\"\",\"\",Teacher4!A7)","v":"จันทร์"},{"$f":"IF(Teacher4!B7=\"\",\"\",Teacher4!B7)","v":""},{"$f":"IF(Teacher4!C7=\"\",\"\",Teacher4!C7)","v":"ส14101"},{"$f":"IF(Teacher4!D7=\"\",\"\",Teacher4!D7)","v":"ศ14101-2"},{"$f":"IF(Teacher4!E7=\"\",\"\",Teacher4!E7)","v":"ท14101"},{"$f":"IF(Teacher4!F7=\"\",\"\",Teacher4!F7)","v":""},{"$f":"IF(Teacher4!G7=\"\",\"\",Teacher4!G7)","v":"ศ16101-1"},{"$f":"IF(Teacher4!H7=\"\",\"\",Teacher4!H7)","v":""},{"$f":"IF(Teacher4!I7=\"\",\"\",Teacher4!I7)","v":"ก14906"},{"$f":"IF(Teacher4!J7=\"\",\"\",Teacher4!J7)","v":""},{"$f":"IF(Teacher4!K7=\"\",\"\",Teacher4!K7)","v":""},{"$f":"IF(Teacher4!L7=\"\",\"\",Teacher4!L7)","v":""},{"$f":"IF(Teacher4!M7=\"\",\"\",Teacher4!M7)","v":""},"จำนวนคาบ/ชั่วโมง ",null,8]
[null,{"$f":"IF(Teacher3!B8=\"\",\"\",Teacher3!B8)","v":"หน้าเสาธง"},{"$f":"IF(Teacher3!C8=\"\",\"\",Teacher3!C8)","v":"ไทย3"},{"$f":"IF(Teacher3!D8=\"\",\"\",Teacher3!D8)","v":"คณิต3"},{"$f":"IF(Teacher3!E8=\"\",\"\",Teacher3!E8)","v":"สุขะ3"},{"$f":"IF(Teacher3!F8=\"\",\"\",Teacher3!F8)","v":"พักกลางวัน"},{"$f":"IF(Teacher3!G8=\"\",\"\",Teacher3!G8)","v":"ดนตรี3"},{"$f":"IF(Teacher3!H8=\"\",\"\",Teacher3!H8)","v":"สังคม3"},{"$f":"IF(Teacher3!I8=\"\",\"\",Teacher3!I8)","v":"ลดเวลาเรียน"},{"$f":"IF(Teacher3!J8=\"\",\"\",Teacher3!J8)","v":""},{"$f":"IF(Teacher3!K8=\"\",\"\",Teacher3!K8)","v":""},{"$f":"IF(Teacher3!L8=\"\",\"\",Teacher3!L8)","v":""},{"$f":"IF(Teacher3!M8=\"\",\"\",Teacher3!M8)","v":""},null,null,{"$f":"IF(Teacher4!B8=\"\",\"\",Teacher4!B8)","v":"หน้าเสาธง"},{"$f":"IF(Teacher4!C8=\"\",\"\",Teacher4!C8)","v":"สังคม4"},{"$f":"IF(Teacher4!D8=\"\",\"\",Teacher4!D8)","v":"ดนตรี4"},{"$f":"IF(Teacher4!E8=\"\",\"\",Teacher4!E8)","v":"ไทย4"},{"$f":"IF(Teacher4!F8=\"\",\"\",Teacher4!F8)","v":"พักกลางวัน"},{"$f":"IF(Teacher4!G8=\"\",\"\",Teacher4!G8)","v":"ศิลปะ6"},{"$f":"IF(Teacher4!H8=\"\",\"\",Teacher4!H8)","v":""},{"$f":"IF(Teacher4!I8=\"\",\"\",Teacher4!I8)","v":"ลดเวลาเรียน"},{"$f":"IF(Teacher4!J8=\"\",\"\",Teacher4!J8)","v":""},{"$f":"IF(Teacher4!K8=\"\",\"\",Teacher4!K8)","v":""},{"$f":"IF(Teacher4!L8=\"\",\"\",Teacher4!L8)","v":""},{"$f":"IF(Teacher4!M8=\"\",\"\",Teacher4!M8)","v":""}]
[null,{"$f":"IF(Teacher3!B9=\"\",\"\",Teacher3!B9)","v":""},{"$f":"IF(Teacher3!C9=\"\",\"\",Teacher3!C9)","v":"ป.3/1"},{"$f":"IF(Teacher3!D9=\"\",\"\",Teacher3!D9)","v":"ป.3/1"},{"$f":"IF(Teacher3!E9=\"\",\"\",Teacher3!E9)","v":"ป.3/1"},{"$f":"IF(Teacher3!F9=\"\",\"\",Teacher3!F9)","v":""},{"$f":"IF(Teacher3!G9=\"\",\"\",Teacher3!G9)","v":"ป.3/1"},{"$f":"IF(Teacher3!H9=\"\",\"\",Teacher3!H9)","v":"ป.3/1"},{"$f":"IF(Teacher3!I9=\"\",\"\",Teacher3!I9)","v":"ป.3/1"},{"$f":"IF(Teacher3!J9=\"\",\"\",Teacher3!J9)","v":""},{"$f":"IF(Teacher3!K9=\"\",\"\",Teacher3!K9)","v":""},{"$f":"IF(Teacher3!L9=\"\",\"\",Teacher3!L9)","v":""},{"$f":"IF(Teacher3!M9=\"\",\"\",Teacher3!M9)","v":""},null,null,{"$f":"IF(Teacher4!B9=\"\",\"\",Teacher4!B9)","v":""},{"$f":"IF(Teacher4!C9=\"\",\"\",Teacher4!C9)","v":"ป.4/1"},{"$f":"IF(Teacher4!D9=\"\",\"\",Teacher4!D9)","v":"ป.4/1"},{"$f":"IF(Teacher4!E9=\"\",\"\",Teacher4!E9)","v":"ป.4/1"},{"$f":"IF(Teacher4!F9=\"\",\"\",Teacher4!F9)","v":""},{"$f":"IF(Teacher4!G9=\"\",\"\",Teacher4!G9)","v":"ป.6/1"},{"$f":"IF(Teacher4!H9=\"\",\"\",Teacher4!H9)","v":""},{"$f":"IF(Teacher4!I9=\"\",\"\",Teacher4!I9)","v":"ป.4/1"},{"$f":"IF(Teacher4!J9=\"\",\"\",Teacher4!J9)","v":""},{"$f":"IF(Teacher4!K9=\"\",\"\",Teacher4!K9)","v":""},{"$f":"IF(Teacher4!L9=\"\",\"\",Teacher4!L9)","v":""},{"$f":"IF(Teacher4!M9=\"\",\"\",Teacher4!M9)","v":""}]
[{"$f":"IF(Teacher3!A10=\"\",\"\",Teacher3!A10)","v":"อังคาร"},{"$f":"IF(Teacher3!B10=\"\",\"\",Teacher3!B10)","v":""},{"$f":"IF(Teacher3!C10=\"\",\"\",Teacher3!C10)","v":""},{"$f":"IF(Teacher3!D10=\"\",\"\",Teacher3!D10)","v":""},{"$f":"IF(Teacher3!E10=\"\",\"\",Teacher3!E10)","v":"ค13101"},{"$f":"IF(Teacher3!F10=\"\",\"\",Teacher3!F10)","v":""},{"$f":"IF(Teacher3!G10=\"\",\"\",Teacher3!G10)","v":"ท13101"},{"$f":"IF(Teacher3!H10=\"\",\"\",Teacher3!H10)","v":"ก12901"},{"$f":"IF(Teacher3!I10=\"\",\"\",Teacher3!I10)","v":"ก12906"},{"$f":"IF(Teacher3!J10=\"\",\"\",Teacher3!J10)","v":""},{"$f":"IF(Teacher3!K10=\"\",\"\",Teacher3!K10)","v":""},{"$f":"IF(Teacher3!L10=\"\",\"\",Teacher3!L10)","v":""},{"$f":"IF(Teacher3!M10=\"\",\"\",Teacher3!M10)","v":""},null,{"$f":"IF(Teacher4!A10=\"\",\"\",Teacher4!A10)","v":"อังคาร"},{"$f":"IF(Teacher4!B10=\"\",\"\",Teacher4!B10)","v":""},{"$f":"IF(Teacher4!C10=\"\",\"\",Teacher4!C10)","v":"ค14101"},{"$f":"IF(Teacher4!D10=\"\",\"\",Teacher4!D10)","v":"ท14101"},{"$f":"IF(Teacher4!E10=\"\",\"\",Teacher4!E10)","v":"ส14102"},{"$f":"IF(Teacher4!F10=\"\",\"\",Teacher4!F10)","v":""},{"$f":"IF(Teacher4!G10=\"\",\"\",Teacher4!G10)","v":"ศ14101-1"},{"$f":"IF(Teacher4!H10=\"\",\"\",Teacher4!H10)","v":"ก14901"},{"$f":"IF(Teacher4!I10=\"\",\"\",Teacher4!I10)","v":"ก14906"},{"$f":"IF(Teacher4!J10=\"\",\"\",Teacher4!J10)","v":""},{"$f":"IF(Teacher4!K10=\"\",\"\",Teacher4!K10)","v":""},{"$f":"IF(Teacher4!L10=\"\",\"\",Teacher4!L10)","v":""},{"$f":"IF(Teacher4!M10=\"\",\"\",Teacher4!M10)","v":""}]
[null,{"$f":"IF(Teacher3!B11=\"\",\"\",Teacher3!B11)","v":"หน้าเสาธง"},{"$f":"IF(Teacher3!C11=\"\",\"\",Teacher3!C11)","v":""},{"$f":"IF(Teacher3!D11=\"\",\"\",Teacher3!D11)","v":""},{"$f":"IF(Teacher3!E11=\"\",\"\",Teacher3!E11)","v":"คณิต3"},{"$f":"IF(Teacher3!F11=\"\",\"\",Teacher3!F11)","v":"พักกลางวัน"},{"$f":"IF(Teacher3!G11=\"\",\"\",Teacher3!G11)","v":"ไทย3"},{"$f":"IF(Teacher3!H11=\"\",\"\",Teacher3!H11)","v":"แนะแนว2"},{"$f":"IF(Teacher3!I11=\"\",\"\",Teacher3!I11)","v":"ลดเวลาเรียน"},{"$f":"IF(Teacher3!J11=\"\",\"\",Teacher3!J11)","v":""},{"$f":"IF(Teacher3!K11=\"\",\"\",Teacher3!K11)","v":""},{"$f":"IF(Teacher3!L11=\"\",\"\",Teacher3!L11)","v":""},{"$f":"IF(Teacher3!M11=\"\",\"\",Teacher3!M11)","v":""},null,null,{"$f":"IF(Teacher4!B11=\"\",\"\",Teacher4!B11)","v":"หน้าเสาธง"},{"$f":"IF(Teacher4!C11=\"\",\"\",Teacher4!C11)","v":"คณิต4"},{"$f":"IF(Teacher4!D11=\"\",\"\",Teacher4!D11)","v":"ไทย4"},{"$f":"IF(Teacher4!E11=\"\",\"\",Teacher4!E11)","v":"ประวัติ4"},{"$f":"IF(Teacher4!F11=\"\",\"\",Teacher4!F11)","v":"พักกลางวัน"},{"$f":"IF(Teacher4!G11=\"\",\"\",Teacher4!G11)","v":"ศิลปะ4"},{"$f":"IF(Teacher4!H11=\"\",\"\",Teacher4!H11)","v":"แนะแนว4"},{"$f":"IF(Teacher4!I11=\"\",\"\",Teacher4!I11)","v":"ลดเวลาเรียน"},{"$f":"IF(Teacher4!J11=\"\",\"\",Teacher4!J11)","v":""},{"$f":"IF(Teacher4!K11=\"\",\"\",Teacher4!K11)","v":""},{"$f":"IF(Teacher4!L11=\"\",\"\",Teacher4!L11)","v":""},{"$f":"IF(Teacher4!M11=\"\",\"\",Teacher4!M11)","v":""}]
[null,{"$f":"IF(Teacher3!B12=\"\",\"\",Teacher3!B12)","v":""},{"$f":"IF(Teacher3!C12=\"\",\"\",Teacher3!C12)","v":""},{"$f":"IF(Teacher3!D12=\"\",\"\",Teacher3!D12)","v":""},{"$f":"IF(Teacher3!E12=\"\",\"\",Teacher3!E12)","v":"ป.3/1"},{"$f":"IF(Teacher3!F12=\"\",\"\",Teacher3!F12)","v":""},{"$f":"IF(Teacher3!G12=\"\",\"\",Teacher3!G12)","v":"ป.3/1"},{"$f":"IF(Teacher3!H12=\"\",\"\",Teacher3!H12)","v":"ป.3/1"},{"$f":"IF(Teacher3!I12=\"\",\"\",Teacher3!I12)","v":"ป.3/1"},{"$f":"IF(Teacher3!J12=\"\",\"\",Teacher3!J12)","v":""},{"$f":"IF(Teacher3!K12=\"\",\"\",Teacher3!K12)","v":""},{"$f":"IF(Teacher3!L12=\"\",\"\",Teacher3!L12)","v":""},{"$f":"IF(Teacher3!M12=\"\",\"\",Teacher3!M12)","v":""},null,null,{"$f":"IF(Teacher4!B12=\"\",\"\",Teacher4!B12)","v":""},{"$f":"IF(Teacher4!C12=\"\",\"\",Teacher4!C12)","v":"ป.4/1"},{"$f":"IF(Teacher4!D12=\"\",\"\",Teacher4!D12)","v":"ป.4/1"},{"$f":"IF(Teacher4!E12=\"\",\"\",Teacher4!E12)","v":"ป.4/1"},{"$f":"IF(Teacher4!F12=\"\",\"\",Teacher4!F12)","v":""},{"$f":"IF(Teacher4!G12=\"\",\"\",Teacher4!G12)","v":"ป.4/1"},{"$f":"IF(Teacher4!H12=\"\",\"\",Teacher4!H12)","v":"ป.4/1"},{"$f":"IF(Teacher4!I12=\"\",\"\",Teacher4!I12)","v":"ป.4/1"},{"$f":"IF(Teacher4!J12=\"\",\"\",Teacher4!J12)","v":""},{"$f":"IF(Teacher4!K12=\"\",\"\",Teacher4!K12)","v":""},{"$f":"IF(Teacher4!L12=\"\",\"\",Teacher4!L12)","v":""},{"$f":"IF(Teacher4!M12=\"\",\"\",Teacher4!M12)","v":""}]
[{"$f":"IF(Teacher3!A13=\"\",\"\",Teacher3!A13)","v":"พุธ"},{"$f":"IF(Teacher3!B13=\"\",\"\",Teacher3!B13)","v":""},{"$f":"IF(Teacher3!C13=\"\",\"\",Teacher3!C13)","v":"ค13101"},{"$f":"IF(Teacher3!D13=\"\",\"\",Teacher3!D13)","v":"ท13101"},{"$f":"IF(Teacher3!E13=\"\",\"\",Teacher3!E13)","v":""},{"$f":"IF(Teacher3!F13=\"\",\"\",Teacher3!F13)","v":""},{"$f":"IF(Teacher3!G13=\"\",\"\",Teacher3!G13)","v":"ส13102"},{"$f":"IF(Teacher3!H13=\"\",\"\",Teacher3!H13)","v":"ก12902"},{"$f":"IF(Teacher3!I13=\"\",\"\",Teacher3!I13)","v":""},{"$f":"IF(Teacher3!J13=\"\",\"\",Teacher3!J13)","v":""},{"$f":"IF(Teacher3!K13=\"\",\"\",Teacher3!K13)","v":""},{"$f":"IF(Teacher3!L13=\"\",\"\",Teacher3!L13)","v":""},{"$f":"IF(Teacher3!M13=\"\",\"\",Teacher3!M13)","v":""},null,{"$f":"IF(Teacher4!A13=\"\",\"\",Teacher4!A13)","v":"พุธ"},{"$f":"IF(Teacher4!B13=\"\",\"\",Teacher4!B13)","v":""},{"$f":"IF(Teacher4!C13=\"\",\"\",Teacher4!C13)","v":"ท14101"},{"$f":"IF(Teacher4!D13=\"\",\"\",Teacher4!D13)","v":""},{"$f":"IF(Teacher4!E13=\"\",\"\",Teacher4!E13)","v":"ค14101"},{"$f":"IF(Teacher4!F13=\"\",\"\",Teacher4!F13)","v":""},{"$f":"IF(Teacher4!G13=\"\",\"\",Teacher4!G13)","v":""},{"$f":"IF(Teacher4!H13=\"\",\"\",Teacher4!H13)","v":"ก14902"},{"$f":"IF(Teacher4!I13=\"\",\"\",Teacher4!I13)","v":"ก14906"},{"$f":"IF(Teacher4!J13=\"\",\"\",Teacher4!J13)","v":""},{"$f":"IF(Teacher4!K13=\"\",\"\",Teacher4!K13)","v":""},{"$f":"IF(Teacher4!L13=\"\",\"\",Teacher4!L13)","v":""},{"$f":"IF(Teacher4!M13=\"\",\"\",Teacher4!M13)","v":""}]
[null,{"$f":"IF(Teacher3!B14=\"\",\"\",Teacher3!B14)","v":"หน้าเสาธง"},{"$f":"IF(Teacher3!C14=\"\",\"\",Teacher3!C14)","v":"คณิต3"},{"$f":"IF(Teacher3!D14=\"\",\"\",Teacher3!D14)","v":"ไทย3"},{"$f":"IF(Teacher3!E14=\"\",\"\",Teacher3!E14)","v":""},{"$f":"IF(Teacher3!F14=\"\",\"\",Teacher3!F14)","v":"พักกลางวัน"},{"$f":"IF(Teacher3!G14=\"\",\"\",Teacher3!G14)","v":"ประวัติ3"},{"$f":"IF(Teacher3!H14=\"\",\"\",Teacher3!H14)","v":"ลูกเสือ2"},{"$f":"IF(Teacher3!I14=\"\",\"\",Teacher3!I14)","v":""},{"$f":"IF(Teacher3!J14=\"\",\"\",Teacher3!J14)","v":""},{"$f":"IF(Teacher3!K14=\"\",\"\",Teacher3!K14)","v":""},{"$f":"IF(Teacher3!L14=\"\",\"\",Teacher3!L14)","v":""},{"$f":"IF(Teacher3!M14=\"\",\"\",Teacher3!M14)","v":""},null,null,{"$f":"IF(Teacher4!B14=\"\",\"\",Teacher4!B14)","v":"หน้าเสาธง"},{"$f":"IF(Teacher4!C14=\"\",\"\",Teacher4!C14)","v":"ไทย4"},{"$f":"IF(Teacher4!D14=\"\",\"\",Teacher4!D14)","v":""},{"$f":"IF(Teacher4!E14=\"\",\"\",Teacher4!E14)","v":"คณิต4"},{"$f":"IF(Teacher4!F14=\"\",\"\",Teacher4!F14)","v":"พักกลางวัน"},{"$f":"IF(Teacher4!G14=\"\",\"\",Teacher4!G14)","v":""},{"$f":"IF(Teacher4!H14=\"\",\"\",Teacher4!H14)","v":"ลูกเสือ4"},{"$f":"IF(Teacher4!I14=\"\",\"\",Teacher4!I14)","v":"ลดเวลาเรียน"},{"$f":"IF(Teacher4!J14=\"\",\"\",Teacher4!J14)","v":""},{"$f":"IF(Teacher4!K14=\"\",\"\",Teacher4!K14)","v":""},{"$f":"IF(Teacher4!L14=\"\",\"\",Teacher4!L14)","v":""},{"$f":"IF(Teacher4!M14=\"\",\"\",Teacher4!M14)","v":""}]
[null,{"$f":"IF(Teacher3!B15=\"\",\"\",Teacher3!B15)","v":""},{"$f":"IF(Teacher3!C15=\"\",\"\",Teacher3!C15)","v":"ป.3/1"},{"$f":"IF(Teacher3!D15=\"\",\"\",Teacher3!D15)","v":"ป.3/1"},{"$f":"IF(Teacher3!E15=\"\",\"\",Teacher3!E15)","v":""},{"$f":"IF(Teacher3!F15=\"\",\"\",Teacher3!F15)","v":""},{"$f":"IF(Teacher3!G15=\"\",\"\",Teacher3!G15)","v":"ป.3/1"},{"$f":"IF(Teacher3!H15=\"\",\"\",Teacher3!H15)","v":"ป.3/1"},{"$f":"IF(Teacher3!I15=\"\",\"\",Teacher3!I15)","v":""},{"$f":"IF(Teacher3!J15=\"\",\"\",Teacher3!J15)","v":""},{"$f":"IF(Teacher3!K15=\"\",\"\",Teacher3!K15)","v":""},{"$f":"IF(Teacher3!L15=\"\",\"\",Teacher3!L15)","v":""},{"$f":"IF(Teacher3!M15=\"\",\"\",Teacher3!M15)","v":""},null,null,{"$f":"IF(Teacher4!B15=\"\",\"\",Teacher4!B15)","v":""},{"$f":"IF(Teacher4!C15=\"\",\"\",Teacher4!C15)","v":"ป.4/1"},{"$f":"IF(Teacher4!D15=\"\",\"\",Teacher4!D15)","v":""},{"$f":"IF(Teacher4!E15=\"\",\"\",Teacher4!E15)","v":"ป.4/1"},{"$f":"IF(Teacher4!F15=\"\",\"\",Teacher4!F15)","v":""},{"$f":"IF(Teacher4!G15=\"\",\"\",Teacher4!G15)","v":""},{"$f":"IF(Teacher4!H15=\"\",\"\",Teacher4!H15)","v":"ป.4/1"},{"$f":"IF(Teacher4!I15=\"\",\"\",Teacher4!I15)","v":"ป.4/1"},{"$f":"IF(Teacher4!J15=\"\",\"\",Teacher4!J15)","v":""},{"$f":"IF(Teacher4!K15=\"\",\"\",Teacher4!K15)","v":""},{"$f":"IF(Teacher4!L15=\"\",\"\",Teacher4!L15)","v":""},{"$f":"IF(Teacher4!M15=\"\",\"\",Teacher4!M15)","v":""}]
[{"$f":"IF(Teacher3!A16=\"\",\"\",Teacher3!A16)","v":"พฤหัสบดี"},{"$f":"IF(Teacher3!B16=\"\",\"\",Teacher3!B16)","v":""},{"$f":"IF(Teacher3!C16=\"\",\"\",Teacher3!C16)","v":"ท13101"},{"$f":"IF(Teacher3!D16=\"\",\"\",Teacher3!D16)","v":"ส13101"},{"$f":"IF(Teacher3!E16=\"\",\"\",Teacher3!E16)","v":"ค13101"},{"$f":"IF(Teacher3!F16=\"\",\"\",Teacher3!F16)","v":""},{"$f":"IF(Teacher3!G16=\"\",\"\",Teacher3!G16)","v":"ศ13101-1"},{"$f":"IF(Teacher3!H16=\"\",\"\",Teacher3!H16)","v":"พ13101-2"},{"$f":"IF(Teacher3!I16=\"\",\"\",Teacher3!I16)","v":"ก12906"},{"$f":"IF(Teacher3!J16=\"\",\"\",Teacher3!J16)","v":""},{"$f":"IF(Teacher3!K16=\"\",\"\",Teacher3!K16)","v":""},{"$f":"IF(Teacher3!L16=\"\",\"\",Teacher3!L16)","v":""},{"$f":"IF(Teacher3!M16=\"\",\"\",Teacher3!M16)","v":""},null,{"$f":"IF(Teacher4!A16=\"\",\"\",Teacher4!A16)","v":"พฤหัสบดี"},{"$f":"IF(Teacher4!B16=\"\",\"\",Teacher4!B16)","v":""},{"$f":"IF(Teacher4!C16=\"\",\"\",Teacher4!C16)","v":"ค14101"},{"$f":"IF(Teacher4!D16=\"\",\"\",Teacher4!D16)","v":""},{"$f":"IF(Teacher4!E16=\"\",\"\",Teacher4!E16)","v":"ง14101-1"},{"$f":"IF(Teacher4!F16=\"\",\"\",Teacher4!F16)","v":""},{"$f":"IF(Teacher4!G16=\"\",\"\",Teacher4!G16)","v":"ศ16101-2"},{"$f":"IF(Teacher4!H16=\"\",\"\",Teacher4!H16)","v":""},{"$f":"IF(Teacher4!I16=\"\",\"\",Teacher4!I16)","v":"ก14906"},{"$f":"IF(Teacher4!J16=\"\",\"\",Teacher4!J16)","v":""},{"$f":"IF(Teacher4!K16=\"\",\"\",Teacher4!K16)","v":""},{"$f":"IF(Teacher4!L16=\"\",\"\",Teacher4!L16)","v":""},{"$f":"IF(Teacher4!M16=\"\",\"\",Teacher4!M16)","v":""}]
[null,{"$f":"IF(Teacher3!B17=\"\",\"\",Teacher3!B17)","v":"หน้าเสาธง"},{"$f":"IF(Teacher3!C17=\"\",\"\",Teacher3!C17)","v":"ไทย3"},{"$f":"IF(Teacher3!D17=\"\",\"\",Teacher3!D17)","v":"สังคม3"},{"$f":"IF(Teacher3!E17=\"\",\"\",Teacher3!E17)","v":"คณิต3"},{"$f":"IF(Teacher3!F17=\"\",\"\",Teacher3!F17)","v":"พักกลางวัน"},{"$f":"IF(Teacher3!G17=\"\",\"\",Teacher3!G17)","v":"ศิลปะ3"},{"$f":"IF(Teacher3!H17=\"\",\"\",Teacher3!H17)","v":"พละ3"},{"$f":"IF(Teacher3!I17=\"\",\"\",Teacher3!I17)","v":"ลดเวลาเรียน"},{"$f":"IF(Teacher3!J17=\"\",\"\",Teacher3!J17)","v":""},{"$f":"IF(Teacher3!K17=\"\",\"\",Teacher3!K17)","v":""},{"$f":"IF(Teacher3!L17=\"\",\"\",Teacher3!L17)","v":""},{"$f":"IF(Teacher3!M17=\"\",\"\",Teacher3!M17)","v":""},null,null,{"$f":"IF(Teacher4!B17=\"\",\"\",Teacher4!B17)","v":"หน้าเสาธง"},{"$f":"IF(Teacher4!C17=\"\",\"\",Teacher4!C17)","v":"คณิต4"},{"$f":"IF(Teacher4!D17=\"\",\"\",Teacher4!D17)","v":""},{"$f":"IF(Teacher4!E17=\"\",\"\",Teacher4!E17)","v":"กอท4"},{"$f":"IF(Teacher4!F17=\"\",\"\",Teacher4!F17)","v":"พักกลางวัน"},{"$f":"IF(Teacher4!G17=\"\",\"\",Teacher4!G17)","v":"ดนตรี6"},{"$f":"IF(Teacher4!H17=\"\",\"\",Teacher4!H17)","v":""},{"$f":"IF(Teacher4!I17=\"\",\"\",Teacher4!I17)","v":"ลดเวลาเรียน"},{"$f":"IF(Teacher4!J17=\"\",\"\",Teacher4!J17)","v":""},{"$f":"IF(Teacher4!K17=\"\",\"\",Teacher4!K17)","v":""},{"$f":"IF(Teacher4!L17=\"\",\"\",Teacher4!L17)","v":""},{"$f":"IF(Teacher4!M17=\"\",\"\",Teacher4!M17)","v":""}]
[null,{"$f":"IF(Teacher3!B18=\"\",\"\",Teacher3!B18)","v":""},{"$f":"IF(Teacher3!C18=\"\",\"\",Teacher3!C18)","v":"ป.3/1"},{"$f":"IF(Teacher3!D18=\"\",\"\",Teacher3!D18)","v":"ป.3/1"},{"$f":"IF(Teacher3!E18=\"\",\"\",Teacher3!E18)","v":"ป.3/1"},{"$f":"IF(Teacher3!F18=\"\",\"\",Teacher3!F18)","v":""},{"$f":"IF(Teacher3!G18=\"\",\"\",Teacher3!G18)","v":"ป.3/1"},{"$f":"IF(Teacher3!H18=\"\",\"\",Teacher3!H18)","v":"ป.3/1"},{"$f":"IF(Teacher3!I18=\"\",\"\",Teacher3!I18)","v":"ป.3/1"},{"$f":"IF(Teacher3!J18=\"\",\"\",Teacher3!J18)","v":""},{"$f":"IF(Teacher3!K18=\"\",\"\",Teacher3!K18)","v":""},{"$f":"IF(Teacher3!L18=\"\",\"\",Teacher3!L18)","v":""},{"$f":"IF(Teacher3!M18=\"\",\"\",Teacher3!M18)","v":""},null,null,{"$f":"IF(Teacher4!B18=\"\",\"\",Teacher4!B18)","v":""},{"$f":"IF(Teacher4!C18=\"\",\"\",Teacher4!C18)","v":"ป.4/1"},{"$f":"IF(Teacher4!D18=\"\",\"\",Teacher4!D18)","v":""},{"$f":"IF(Teacher4!E18=\"\",\"\",Teacher4!E18)","v":"ป.4/1"},{"$f":"IF(Teacher4!F18=\"\",\"\",Teacher4!F18)","v":""},{"$f":"IF(Teacher4!G18=\"\",\"\",Teacher4!G18)","v":"ป.6/1"},{"$f":"IF(Teacher4!H18=\"\",\"\",Teacher4!H18)","v":""},{"$f":"IF(Teacher4!I18=\"\",\"\",Teacher4!I18)","v":"ป.4/1"},{"$f":"IF(Teacher4!J18=\"\",\"\",Teacher4!J18)","v":""},{"$f":"IF(Teacher4!K18=\"\",\"\",Teacher4!K18)","v":""},{"$f":"IF(Teacher4!L18=\"\",\"\",Teacher4!L18)","v":""},{"$f":"IF(Teacher4!M18=\"\",\"\",Teacher4!M18)","v":""}]
[{"$f":"IF(Teacher3!A19=\"\",\"\",Teacher3!A19)","v":"ศุกร์"},{"$f":"IF(Teacher3!B19=\"\",\"\",Teacher3!B19)","v":""},{"$f":"IF(Teacher3!C19=\"\",\"\",Teacher3!C19)","v":""},{"$f":"IF(Teacher3!D19=\"\",\"\",Teacher3!D19)","v":"ค13101"},{"$f":"IF(Teacher3!E19=\"\",\"\",Teacher3!E19)","v":"ท13101"},{"$f":"IF(Teacher3!F19=\"\",\"\",Teacher3!F19)","v":""},{"$f":"IF(Teacher3!G19=\"\",\"\",Teacher3!G19)","v":"ง13101-1"},{"$f":"IF(Teacher3!H19=\"\",\"\",Teacher3!H19)","v":"ก12903"},{"$f":"IF(Teacher3!I19=\"\",\"\",Teacher3!I19)","v":"ก12906"},{"$f":"IF(Teacher3!J19=\"\",\"\",Teacher3!J19)","v":""},{"$f":"IF(Teacher3!K19=\"\",\"\",Teacher3!K19)","v":""},{"$f":"IF(Teacher3!L19=\"\",\"\",Teacher3!L19)","v":""},{"$f":"IF(Teacher3!M19=\"\",\"\",Teacher3!M19)","v":""},null,{"$f":"IF(Teacher4!A19=\"\",\"\",Teacher4!A19)","v":"ศุกร์"},{"$f":"IF(Teacher4!B19=\"\",\"\",Teacher4!B19)","v":""},{"$f":"IF(Teacher4!C19=\"\",\"\",Teacher4!C19)","v":""},{"$f":"IF(Teacher4!D19=\"\",\"\",Teacher4!D19)","v":"ท14101"},{"$f":"IF(Teacher4!E19=\"\",\"\",Teacher4!E19)","v":"ค14101"},{"$f":"IF(Teacher4!F19=\"\",\"\",Teacher4!F19)","v":""},{"$f":"IF(Teacher4!G19=\"\",\"\",Teacher4!G19)","v":"ส14101"},{"$f":"IF(Teacher4!H19=\"\",\"\",Teacher4!H19)","v":"ก14903"},{"$f":"IF(Teacher4!I19=\"\",\"\",Teacher4!I19)","v":"ก14906"},{"$f":"IF(Teacher4!J19=\"\",\"\",Teacher4!J19)","v":""},{"$f":"IF(Teacher4!K19=\"\",\"\",Teacher4!K19)","v":""},{"$f":"IF(Teacher4!L19=\"\",\"\",Teacher4!L19)","v":""},{"$f":"IF(Teacher4!M19=\"\",\"\",Teacher4!M19)","v":""}]
[null,{"$f":"IF(Teacher3!B20=\"\",\"\",Teacher3!B20)","v":"หน้าเสาธง"},{"$f":"IF(Teacher3!C20=\"\",\"\",Teacher3!C20)","v":""},{"$f":"IF(Teacher3!D20=\"\",\"\",Teacher3!D20)","v":"คณิต3"},{"$f":"IF(Teacher3!E20=\"\",\"\",Teacher3!E20)","v":"ไทย3"},{"$f":"IF(Teacher3!F20=\"\",\"\",Teacher3!F20)","v":"พักกลางวัน"},{"$f":"IF(Teacher3!G20=\"\",\"\",Teacher3!G20)","v":"กอท3"},{"$f":"IF(Teacher3!H20=\"\",\"\",Teacher3!H20)","v":"ชุมนุม2"},{"$f":"IF(Teacher3!I20=\"\",\"\",Teacher3!I20)","v":"ลดเวลาเรียน"},{"$f":"IF(Teacher3!J20=\"\",\"\",Teacher3!J20)","v":""},{"$f":"IF(Teacher3!K20=\"\",\"\",Teacher3!K20)","v":""},{"$f":"IF(Teacher3!L20=\"\",\"\",Teacher3!L20)","v":""},{"$f":"IF(Teacher3!M20=\"\",\"\",Teacher3!M20)","v":""},null,null,{"$f":"IF(Teacher4!B20=\"\",\"\",Teacher4!B20)","v":"หน้าเสาธง"},{"$f":"IF(Teacher4!C20=\"\",\"\",Teacher4!C20)","v":""},{"$f":"IF(Teacher4!D20=\"\",\"\",Teacher4!D20)","v":"ไทย4"},{"$f":"IF(Teacher4!E20=\"\",\"\",Teacher4!E20)","v":"คณิต4"},{"$f":"IF(Teacher4!F20=\"\",\"\",Teacher4!F20)","v":"พักกลางวัน"},{"$f":"IF(Teacher4!G20=\"\",\"\",Teacher4!G20)","v":"สังคม4"},{"$f":"IF(Teacher4!H20=\"\",\"\",Teacher4!H20)","v":"ชุมนุม4"},{"$f":"IF(Teacher4!I20=\"\",\"\",Teacher4!I20)","v":"ลดเวลาเรียน"},{"$f":"IF(Teacher4!J20=\"\",\"\",Teacher4!J20)","v":""},{"$f":"IF(Teacher4!K20=\"\",\"\",Teacher4!K20)","v":""},{"$f":"IF(Teacher4!L20=\"\",\"\",Teacher4!L20)","v":""},{"$f":"IF(Teacher4!M20=\"\",\"\",Teacher4!M20)","v":""}]
[null,{"$f":"IF(Teacher3!B21=\"\",\"\",Teacher3!B21)","v":""},{"$f":"IF(Teacher3!C21=\"\",\"\",Teacher3!C21)","v":""},{"$f":"IF(Teacher3!D21=\"\",\"\",Teacher3!D21)","v":"ป.3/1"},{"$f":"IF(Teacher3!E21=\"\",\"\",Teacher3!E21)","v":"ป.3/1"},{"$f":"IF(Teacher3!F21=\"\",\"\",Teacher3!F21)","v":""},{"$f":"IF(Teacher3!G21=\"\",\"\",Teacher3!G21)","v":"ป.3/1"},{"$f":"IF(Teacher3!H21=\"\",\"\",Teacher3!H21)","v":"ป.3/1"},{"$f":"IF(Teacher3!I21=\"\",\"\",Teacher3!I21)","v":"ป.3/1"},{"$f":"IF(Teacher3!J21=\"\",\"\",Teacher3!J21)","v":""},{"$f":"IF(Teacher3!K21=\"\",\"\",Teacher3!K21)","v":""},{"$f":"IF(Teacher3!L21=\"\",\"\",Teacher3!L21)","v":""},{"$f":"IF(Teacher3!M21=\"\",\"\",Teacher3!M21)","v":""},null,null,{"$f":"IF(Teacher4!B21=\"\",\"\",Teacher4!B21)","v":""},{"$f":"IF(Teacher4!C21=\"\",\"\",Teacher4!C21)","v":""},{"$f":"IF(Teacher4!D21=\"\",\"\",Teacher4!D21)","v":"ป.4/1"},{"$f":"IF(Teacher4!E21=\"\",\"\",Teacher4!E21)","v":"ป.4/1"},{"$f":"IF(Teacher4!F21=\"\",\"\",Teacher4!F21)","v":""},{"$f":"IF(Teacher4!G21=\"\",\"\",Teacher4!G21)","v":"ป.4/1"},{"$f":"IF(Teacher4!H21=\"\",\"\",Teacher4!H21)","v":"ป.4/1"},{"$f":"IF(Teacher4!I21=\"\",\"\",Teacher4!I21)","v":"ป.4/1"},{"$f":"IF(Teacher4!J21=\"\",\"\",Teacher4!J21)","v":""},{"$f":"IF(Teacher4!K21=\"\",\"\",Teacher4!K21)","v":""},{"$f":"IF(Teacher4!L21=\"\",\"\",Teacher4!L21)","v":""},{"$f":"IF(Teacher4!M21=\"\",\"\",Teacher4!M21)","v":""}]
[{"$f":"IF(Teacher3!A22=\"\",\"\",Teacher3!A22)","v":"เสาร์"},{"$f":"IF(Teacher3!B22=\"\",\"\",Teacher3!B22)","v":""},{"$f":"IF(Teacher3!C22=\"\",\"\",Teacher3!C22)","v":""},{"$f":"IF(Teacher3!D22=\"\",\"\",Teacher3!D22)","v":""},{"$f":"IF(Teacher3!E22=\"\",\"\",Teacher3!E22)","v":""},{"$f":"IF(Teacher3!F22=\"\",\"\",Teacher3!F22)","v":""},{"$f":"IF(Teacher3!G22=\"\",\"\",Teacher3!G22)","v":""},{"$f":"IF(Teacher3!H22=\"\",\"\",Teacher3!H22)","v":""},{"$f":"IF(Teacher3!I22=\"\",\"\",Teacher3!I22)","v":""},{"$f":"IF(Teacher3!J22=\"\",\"\",Teacher3!J22)","v":""},{"$f":"IF(Teacher3!K22=\"\",\"\",Teacher3!K22)","v":""},{"$f":"IF(Teacher3!L22=\"\",\"\",Teacher3!L22)","v":""},{"$f":"IF(Teacher3!M22=\"\",\"\",Teacher3!M22)","v":""},null,{"$f":"IF(Teacher4!A22=\"\",\"\",Teacher4!A22)","v":"เสาร์"},{"$f":"IF(Teacher4!B22=\"\",\"\",Teacher4!B22)","v":""},{"$f":"IF(Teacher4!C22=\"\",\"\",Teacher4!C22)","v":""},{"$f":"IF(Teacher4!D22=\"\",\"\",Teacher4!D22)","v":""},{"$f":"IF(Teacher4!E22=\"\",\"\",Teacher4!E22)","v":""},{"$f":"IF(Teacher4!F22=\"\",\"\",Teacher4!F22)","v":""},{"$f":"IF(Teacher4!G22=\"\",\"\",Teacher4!G22)","v":""},{"$f":"IF(Teacher4!H22=\"\",\"\",Teacher4!H22)","v":""},{"$f":"IF(Teacher4!I22=\"\",\"\",Teacher4!I22)","v":""},{"$f":"IF(Teacher4!J22=\"\",\"\",Teacher4!J22)","v":""},{"$f":"IF(Teacher4!K22=\"\",\"\",Teacher4!K22)","v":""},{"$f":"IF(Teacher4!L22=\"\",\"\",Teacher4!L22)","v":""},{"$f":"IF(Teacher4!M22=\"\",\"\",Teacher4!M22)","v":""}]
[null,{"$f":"IF(Teacher3!B23=\"\",\"\",Teacher3!B23)","v":""},{"$f":"IF(Teacher3!C23=\"\",\"\",Teacher3!C23)","v":""},{"$f":"IF(Teacher3!D23=\"\",\"\",Teacher3!D23)","v":""},{"$f":"IF(Teacher3!E23=\"\",\"\",Teacher3!E23)","v":""},{"$f":"IF(Teacher3!F23=\"\",\"\",Teacher3!F23)","v":""},{"$f":"IF(Teacher3!G23=\"\",\"\",Teacher3!G23)","v":""},{"$f":"IF(Teacher3!H23=\"\",\"\",Teacher3!H23)","v":""},{"$f":"IF(Teacher3!I23=\"\",\"\",Teacher3!I23)","v":""},{"$f":"IF(Teacher3!J23=\"\",\"\",Teacher3!J23)","v":""},{"$f":"IF(Teacher3!K23=\"\",\"\",Teacher3!K23)","v":""},{"$f":"IF(Teacher3!L23=\"\",\"\",Teacher3!L23)","v":""},{"$f":"IF(Teacher3!M23=\"\",\"\",Teacher3!M23)","v":""},null,null,{"$f":"IF(Teacher4!B23=\"\",\"\",Teacher4!B23)","v":""},{"$f":"IF(Teacher4!C23=\"\",\"\",Teacher4!C23)","v":""},{"$f":"IF(Teacher4!D23=\"\",\"\",Teacher4!D23)","v":""},{"$f":"IF(Teacher4!E23=\"\",\"\",Teacher4!E23)","v":""},{"$f":"IF(Teacher4!F23=\"\",\"\",Teacher4!F23)","v":""},{"$f":"IF(Teacher4!G23=\"\",\"\",Teacher4!G23)","v":""},{"$f":"IF(Teacher4!H23=\"\",\"\",Teacher4!H23)","v":""},{"$f":"IF(Teacher4!I23=\"\",\"\",Teacher4!I23)","v":""},{"$f":"IF(Teacher4!J23=\"\",\"\",Teacher4!J23)","v":""},{"$f":"IF(Teacher4!K23=\"\",\"\",Teacher4!K23)","v":""},{"$f":"IF(Teacher4!L23=\"\",\"\",Teacher4!L23)","v":""},{"$f":"IF(Teacher4!M23=\"\",\"\",Teacher4!M23)","v":""}]
[null,{"$f":"IF(Teacher3!B24=\"\",\"\",Teacher3!B24)","v":""},{"$f":"IF(Teacher3!C24=\"\",\"\",Teacher3!C24)","v":""},{"$f":"IF(Teacher3!D24=\"\",\"\",Teacher3!D24)","v":""},{"$f":"IF(Teacher3!E24=\"\",\"\",Teacher3!E24)","v":""},{"$f":"IF(Teacher3!F24=\"\",\"\",Teacher3!F24)","v":""},{"$f":"IF(Teacher3!G24=\"\",\"\",Teacher3!G24)","v":""},{"$f":"IF(Teacher3!H24=\"\",\"\",Teacher3!H24)","v":""},{"$f":"IF(Teacher3!I24=\"\",\"\",Teacher3!I24)","v":""},{"$f":"IF(Teacher3!J24=\"\",\"\",Teacher3!J24)","v":""},{"$f":"IF(Teacher3!K24=\"\",\"\",Teacher3!K24)","v":""},{"$f":"IF(Teacher3!L24=\"\",\"\",Teacher3!L24)","v":""},{"$f":"IF(Teacher3!M24=\"\",\"\",Teacher3!M24)","v":""},null,null,{"$f":"IF(Teacher4!B24=\"\",\"\",Teacher4!B24)","v":""},{"$f":"IF(Teacher4!C24=\"\",\"\",Teacher4!C24)","v":""},{"$f":"IF(Teacher4!D24=\"\",\"\",Teacher4!D24)","v":""},{"$f":"IF(Teacher4!E24=\"\",\"\",Teacher4!E24)","v":""},{"$f":"IF(Teacher4!F24=\"\",\"\",Teacher4!F24)","v":""},{"$f":"IF(Teacher4!G24=\"\",\"\",Teacher4!G24)","v":""},{"$f":"IF(Teacher4!H24=\"\",\"\",Teacher4!H24)","v":""},{"$f":"IF(Teacher4!I24=\"\",\"\",Teacher4!I24)","v":""},{"$f":"IF(Teacher4!J24=\"\",\"\",Teacher4!J24)","v":""},{"$f":"IF(Teacher4!K24=\"\",\"\",Teacher4!K24)","v":""},{"$f":"IF(Teacher4!L24=\"\",\"\",Teacher4!L24)","v":""},{"$f":"IF(Teacher4!M24=\"\",\"\",Teacher4!M24)","v":""}]
[{"$f":"IF(Teacher3!A25=\"\",\"\",Teacher3!A25)","v":"อาทิตย์"},{"$f":"IF(Teacher3!B25=\"\",\"\",Teacher3!B25)","v":""},{"$f":"IF(Teacher3!C25=\"\",\"\",Teacher3!C25)","v":""},{"$f":"IF(Teacher3!D25=\"\",\"\",Teacher3!D25)","v":""},{"$f":"IF(Teacher3!E25=\"\",\"\",Teacher3!E25)","v":""},{"$f":"IF(Teacher3!F25=\"\",\"\",Teacher3!F25)","v":""},{"$f":"IF(Teacher3!G25=\"\",\"\",Teacher3!G25)","v":""},{"$f":"IF(Teacher3!H25=\"\",\"\",Teacher3!H25)","v":""},{"$f":"IF(Teacher3!I25=\"\",\"\",Teacher3!I25)","v":""},{"$f":"IF(Teacher3!J25=\"\",\"\",Teacher3!J25)","v":""},{"$f":"IF(Teacher3!K25=\"\",\"\",Teacher3!K25)","v":""},{"$f":"IF(Teacher3!L25=\"\",\"\",Teacher3!L25)","v":""},{"$f":"IF(Teacher3!M25=\"\",\"\",Teacher3!M25)","v":""},null,{"$f":"IF(Teacher4!A25=\"\",\"\",Teacher4!A25)","v":"อาทิตย์"},{"$f":"IF(Teacher4!B25=\"\",\"\",Teacher4!B25)","v":""},{"$f":"IF(Teacher4!C25=\"\",\"\",Teacher4!C25)","v":""},{"$f":"IF(Teacher4!D25=\"\",\"\",Teacher4!D25)","v":""},{"$f":"IF(Teacher4!E25=\"\",\"\",Teacher4!E25)","v":""},{"$f":"IF(Teacher4!F25=\"\",\"\",Teacher4!F25)","v":""},{"$f":"IF(Teacher4!G25=\"\",\"\",Teacher4!G25)","v":""},{"$f":"IF(Teacher4!H25=\"\",\"\",Teacher4!H25)","v":""},{"$f":"IF(Teacher4!I25=\"\",\"\",Teacher4!I25)","v":""},{"$f":"IF(Teacher4!J25=\"\",\"\",Teacher4!J25)","v":""},{"$f":"IF(Teacher4!K25=\"\",\"\",Teacher4!K25)","v":""},{"$f":"IF(Teacher4!L25=\"\",\"\",Teacher4!L25)","v":""},{"$f":"IF(Teacher4!M25=\"\",\"\",Teacher4!M25)","v":""}]
[null,{"$f":"IF(Teacher3!B26=\"\",\"\",Teacher3!B26)","v":""},{"$f":"IF(Teacher3!C26=\"\",\"\",Teacher3!C26)","v":""},{"$f":"IF(Teacher3!D26=\"\",\"\",Teacher3!D26)","v":""},{"$f":"IF(Teacher3!E26=\"\",\"\",Teacher3!E26)","v":""},{"$f":"IF(Teacher3!F26=\"\",\"\",Teacher3!F26)","v":""},{"$f":"IF(Teacher3!G26=\"\",\"\",Teacher3!G26)","v":""},{"$f":"IF(Teacher3!H26=\"\",\"\",Teacher3!H26)","v":""},{"$f":"IF(Teacher3!I26=\"\",\"\",Teacher3!I26)","v":""},{"$f":"IF(Teacher3!J26=\"\",\"\",Teacher3!J26)","v":""},{"$f":"IF(Teacher3!K26=\"\",\"\",Teacher3!K26)","v":""},{"$f":"IF(Teacher3!L26=\"\",\"\",Teacher3!L26)","v":""},{"$f":"IF(Teacher3!M26=\"\",\"\",Teacher3!M26)","v":""},null,null,{"$f":"IF(Teacher4!B26=\"\",\"\",Teacher4!B26)","v":""},{"$f":"IF(Teacher4!C26=\"\",\"\",Teacher4!C26)","v":""},{"$f":"IF(Teacher4!D26=\"\",\"\",Teacher4!D26)","v":""},{"$f":"IF(Teacher4!E26=\"\",\"\",Teacher4!E26)","v":""},{"$f":"IF(Teacher4!F26=\"\",\"\",Teacher4!F26)","v":""},{"$f":"IF(Teacher4!G26=\"\",\"\",Teacher4!G26)","v":""},{"$f":"IF(Teacher4!H26=\"\",\"\",Teacher4!H26)","v":""},{"$f":"IF(Teacher4!I26=\"\",\"\",Teacher4!I26)","v":""},{"$f":"IF(Teacher4!J26=\"\",\"\",Teacher4!J26)","v":""},{"$f":"IF(Teacher4!K26=\"\",\"\",Teacher4!K26)","v":""},{"$f":"IF(Teacher4!L26=\"\",\"\",Teacher4!L26)","v":""},{"$f":"IF(Teacher4!M26=\"\",\"\",Teacher4!M26)","v":""}]
[null,{"$f":"IF(Teacher3!B27=\"\",\"\",Teacher3!B27)","v":""},{"$f":"IF(Teacher3!C27=\"\",\"\",Teacher3!C27)","v":""},{"$f":"IF(Teacher3!D27=\"\",\"\",Teacher3!D27)","v":""},{"$f":"IF(Teacher3!E27=\"\",\"\",Teacher3!E27)","v":""},{"$f":"IF(Teacher3!F27=\"\",\"\",Teacher3!F27)","v":""},{"$f":"IF(Teacher3!G27=\"\",\"\",Teacher3!G27)","v":""},{"$f":"IF(Teacher3!H27=\"\",\"\",Teacher3!H27)","v":""},{"$f":"IF(Teacher3!I27=\"\",\"\",Teacher3!I27)","v":""},{"$f":"IF(Teacher3!J27=\"\",\"\",Teacher3!J27)","v":""},{"$f":"IF(Teacher3!K27=\"\",\"\",Teacher3!K27)","v":""},{"$f":"IF(Teacher3!L27=\"\",\"\",Teacher3!L27)","v":""},{"$f":"IF(Teacher3!M27=\"\",\"\",Teacher3!M27)","v":""},null,null,{"$f":"IF(Teacher4!B27=\"\",\"\",Teacher4!B27)","v":""},{"$f":"IF(Teacher4!C27=\"\",\"\",Teacher4!C27)","v":""},{"$f":"IF(Teacher4!D27=\"\",\"\",Teacher4!D27)","v":""},{"$f":"IF(Teacher4!E27=\"\",\"\",Teacher4!E27)","v":""},{"$f":"IF(Teacher4!F27=\"\",\"\",Teacher4!F27)","v":""},{"$f":"IF(Teacher4!G27=\"\",\"\",Teacher4!G27)","v":""},{"$f":"IF(Teacher4!H27=\"\",\"\",Teacher4!H27)","v":""},{"$f":"IF(Teacher4!I27=\"\",\"\",Teacher4!I27)","v":""},{"$f":"IF(Teacher4!J27=\"\",\"\",Teacher4!J27)","v":""},{"$f":"IF(Teacher4!K27=\"\",\"\",Teacher4!K27)","v":""},{"$f":"IF(Teacher4!L27=\"\",\"\",Teacher4!L27)","v":""},{"$f":"IF(Teacher4!M27=\"\",\"\",Teacher4!M27)","v":""}]
[]
[{"$f":"IF(Teacher5!A1=\"\",\"\",Teacher5!A1)","v":"โรงเรียนบ้านน้ำสอด สำนักงานเขตพื้นที่การศึกษาประถมศึกษาน่าน เขต 2"},null,null,null,null,null,null,null,null,null,null,null,null,null,{"$f":"IF(Teacher6!A1=\"\",\"\",Teacher6!A1)","v":"โรงเรียนบ้านน้ำสอด สำนักงานเขตพื้นที่การศึกษาประถมศึกษาน่าน เขต 2"}]
[{"$f":"IF(Teacher5!A2=\"\",\"\",Teacher5!A2)","v":"ตารางสอนของ นายบุญธรรม  บุญลาภังค์  ภาคเรียนที่ 2 ปีการศึกษา 2559"},null,null,null,null,null,null,null,null,null,null,null,null,null,{"$f":"IF(Teacher6!A2=\"\",\"\",Teacher6!A2)","v":"ตารางสอนของ นายอุทัย  รัตนกันทา  ภาคเรียนที่ 2 ปีการศึกษา 2559"}]
[]
[{"$f":"IF(Teacher5!A4=\"\",\"\",Teacher5!A4)","v":"วัน"},{"$f":"IF(Teacher5!B4=\"\",\"\",Teacher5!B4)","v":"ชั่วโมงที่"},null,null,null,null,null,null,null,null,null,null,null,null,{"$f":"IF(Teacher6!A4=\"\",\"\",Teacher6!A4)","v":"วัน"},{"$f":"IF(Teacher6!B4=\"\",\"\",Teacher6!B4)","v":"ชั่วโมงที่"}]
[null,{"$f":"IF(Teacher5!B5=\"\",\"\",Teacher5!B5)","v":1},{"$f":"IF(Teacher5!C5=\"\",\"\",Teacher5!C5)","v":2},{"$f":"IF(Teacher5!D5=\"\",\"\",Teacher5!D5)","v":3},{"$f":"IF(Teacher5!E5=\"\",\"\",Teacher5!E5)","v":4},{"$f":"IF(Teacher5!F5=\"\",\"\",Teacher5!F5)","v":5},{"$f":"IF(Teacher5!G5=\"\",\"\",Teacher5!G5)","v":6},{"$f":"IF(Teacher5!H5=\"\",\"\",Teacher5!H5)","v":7},{"$f":"IF(Teacher5!I5=\"\",\"\",Teacher5!I5)","v":8},{"$f":"IF(Teacher5!J5=\"\",\"\",Teacher5!J5)","v":9},{"$f":"IF(Teacher5!K5=\"\",\"\",Teacher5!K5)","v":10},{"$f":"IF(Teacher5!L5=\"\",\"\",Teacher5!L5)","v":11},{"$f":"IF(Teacher5!M5=\"\",\"\",Teacher5!M5)","v":12},null,null,{"$f":"IF(Teacher6!B5=\"\",\"\",Teacher6!B5)","v":1},{"$f":"IF(Teacher6!C5=\"\",\"\",Teacher6!C5)","v":2},{"$f":"IF(Teacher6!D5=\"\",\"\",Teacher6!D5)","v":3},{"$f":"IF(Teacher6!E5=\"\",\"\",Teacher6!E5)","v":4},{"$f":"IF(Teacher6!F5=\"\",\"\",Teacher6!F5)","v":5},{"$f":"IF(Teacher6!G5=\"\",\"\",Teacher6!G5)","v":6},{"$f":"IF(Teacher6!H5=\"\",\"\",Teacher6!H5)","v":7},{"$f":"IF(Teacher6!I5=\"\",\"\",Teacher6!I5)","v":8},{"$f":"IF(Teacher6!J5=\"\",\"\",Teacher6!J5)","v":9},{"$f":"IF(Teacher6!K5=\"\",\"\",Teacher6!K5)","v":10},{"$f":"IF(Teacher6!L5=\"\",\"\",Teacher6!L5)","v":11},{"$f":"IF(Teacher6!M5=\"\",\"\",Teacher6!M5)","v":12}]
[{"$f":"IF(Teacher5!A6=\"\",\"\",Teacher5!A6)","v":"เวลา"},{"$f":"IF(Teacher5!B6=\"\",\"\",Teacher5!B6)","v":"8.00 - 8.30"},{"$f":"IF(Teacher5!C6=\"\",\"\",Teacher5!C6)","v":"8.31 - 9.30"},{"$f":"IF(Teacher5!D6=\"\",\"\",Teacher5!D6)","v":"9.31 - 10.30"},{"$f":"IF(Teacher5!E6=\"\",\"\",Teacher5!E6)","v":"10.31 - 11.30"},{"$f":"IF(Teacher5!F6=\"\",\"\",Teacher5!F6)","v":"11.31 - 12.30"},{"$f":"IF(Teacher5!G6=\"\",\"\",Teacher5!G6)","v":"12.31 - 13.30"},{"$f":"IF(Teacher5!H6=\"\",\"\",Teacher5!H6)","v":"13.31 - 14.30"},{"$f":"IF(Teacher5!I6=\"\",\"\",Teacher5!I6)","v":"14.31 - 15.30"},{"$f":"IF(Teacher5!J6=\"\",\"\",Teacher5!J6)","v":" - "},{"$f":"IF(Teacher5!K6=\"\",\"\",Teacher5!K6)","v":" - "},{"$f":"IF(Teacher5!L6=\"\",\"\",Teacher5!L6)","v":" - "},{"$f":"IF(Teacher5!M6=\"\",\"\",Teacher5!M6)","v":" - "},null,{"$f":"IF(Teacher6!A6=\"\",\"\",Teacher6!A6)","v":"เวลา"},{"$f":"IF(Teacher6!B6=\"\",\"\",Teacher6!B6)","v":"8.00 - 8.30"},{"$f":"IF(Teacher6!C6=\"\",\"\",Teacher6!C6)","v":"8.31 - 9.30"},{"$f":"IF(Teacher6!D6=\"\",\"\",Teacher6!D6)","v":"9.31 - 10.30"},{"$f":"IF(Teacher6!E6=\"\",\"\",Teacher6!E6)","v":"10.31 - 11.30"},{"$f":"IF(Teacher6!F6=\"\",\"\",Teacher6!F6)","v":"11.31 - 12.30"},{"$f":"IF(Teacher6!G6=\"\",\"\",Teacher6!G6)","v":"12.31 - 13.30"},{"$f":"IF(Teacher6!H6=\"\",\"\",Teacher6!H6)","v":"13.31 - 14.30"},{"$f":"IF(Teacher6!I6=\"\",\"\",Teacher6!I6)","v":"14.31 - 15.30"},{"$f":"IF(Teacher6!J6=\"\",\"\",Teacher6!J6)","v":" - "},{"$f":"IF(Teacher6!K6=\"\",\"\",Teacher6!K6)","v":" - "},{"$f":"IF(Teacher6!L6=\"\",\"\",Teacher6!L6)","v":" - "},{"$f":"IF(Teacher6!M6=\"\",\"\",Teacher6!M6)","v":" - "}]
[{"$f":"IF(Teacher5!A7=\"\",\"\",Teacher5!A7)","v":"จันทร์"},{"$f":"IF(Teacher5!B7=\"\",\"\",Teacher5!B7)","v":""},{"$f":"IF(Teacher5!C7=\"\",\"\",Teacher5!C7)","v":"ค15101"},{"$f":"IF(Teacher5!D7=\"\",\"\",Teacher5!D7)","v":""},{"$f":"IF(Teacher5!E7=\"\",\"\",Teacher5!E7)","v":"ศ15101-2"},{"$f":"IF(Teacher5!F7=\"\",\"\",Teacher5!F7)","v":""},{"$f":"IF(Teacher5!G7=\"\",\"\",Teacher5!G7)","v":"ท15101"},{"$f":"IF(Teacher5!H7=\"\",\"\",Teacher5!H7)","v":"ง16101-2"},{"$f":"IF(Teacher5!I7=\"\",\"\",Teacher5!I7)","v":"ก11905"},{"$f":"IF(Teacher5!J7=\"\",\"\",Teacher5!J7)","v":""},{"$f":"IF(Teacher5!K7=\"\",\"\",Teacher5!K7)","v":""},{"$f":"IF(Teacher5!L7=\"\",\"\",Teacher5!L7)","v":""},{"$f":"IF(Teacher5!M7=\"\",\"\",Teacher5!M7)","v":""},null,{"$f":"IF(Teacher6!A7=\"\",\"\",Teacher6!A7)","v":"จันทร์"},{"$f":"IF(Teacher6!B7=\"\",\"\",Teacher6!B7)","v":""},{"$f":"IF(Teacher6!C7=\"\",\"\",Teacher6!C7)","v":"ท16101"},{"$f":"IF(Teacher6!D7=\"\",\"\",Teacher6!D7)","v":"ส16101"},{"$f":"IF(Teacher6!E7=\"\",\"\",Teacher6!E7)","v":"ค16101"},{"$f":"IF(Teacher6!F7=\"\",\"\",Teacher6!F7)","v":""},{"$f":"IF(Teacher6!G7=\"\",\"\",Teacher6!G7)","v":""},{"$f":"IF(Teacher6!H7=\"\",\"\",Teacher6!H7)","v":"พ14101-1"},{"$f":"IF(Teacher6!I7=\"\",\"\",Teacher6!I7)","v":"ก16906"},{"$f":"IF(Teacher6!J7=\"\",\"\",Teacher6!J7)","v":""},{"$f":"IF(Teacher6!K7=\"\",\"\",Teacher6!K7)","v":""},{"$f":"IF(Teacher6!L7=\"\",\"\",Teacher6!L7)","v":""},{"$f":"IF(Teacher6!M7=\"\",\"\",Teacher6!M7)","v":""}]
[null,{"$f":"IF(Teacher5!B8=\"\",\"\",Teacher5!B8)","v":"หน้าเสาธง"},{"$f":"IF(Teacher5!C8=\"\",\"\",Teacher5!C8)","v":"คณิต5"},{"$f":"IF(Teacher5!D8=\"\",\"\",Teacher5!D8)","v":""},{"$f":"IF(Teacher5!E8=\"\",\"\",Teacher5!E8)","v":"ดนตรี5"},{"$f":"IF(Teacher5!F8=\"\",\"\",Teacher5!F8)","v":"พักกลางวัน"},{"$f":"IF(Teacher5!G8=\"\",\"\",Teacher5!G8)","v":"ไทย5"},{"$f":"IF(Teacher5!H8=\"\",\"\",Teacher5!H8)","v":"คอมพิวเตอร์"},{"$f":"IF(Teacher5!I8=\"\",\"\",Teacher5!I8)","v":"ICT1"},{"$f":"IF(Teacher5!J8=\"\",\"\",Teacher5!J8)","v":""},{"$f":"IF(Teacher5!K8=\"\",\"\",Teacher5!K8)","v":""},{"$f":"IF(Teacher5!L8=\"\",\"\",Teacher5!L8)","v":""},{"$f":"IF(Teacher5!M8=\"\",\"\",Teacher5!M8)","v":""},null,null,{"$f":"IF(Teacher6!B8=\"\",\"\",Teacher6!B8)","v":"หน้าเสาธง"},{"$f":"IF(Teacher6!C8=\"\",\"\",Teacher6!C8)","v":"ไทย6"},{"$f":"IF(Teacher6!D8=\"\",\"\",Teacher6!D8)","v":"สังคม6"},{"$f":"IF(Teacher6!E8=\"\",\"\",Teacher6!E8)","v":"คณิต6"},{"$f":"IF(Teacher6!F8=\"\",\"\",Teacher6!F8)","v":"พักกลางวัน"},{"$f":"IF(Teacher6!G8=\"\",\"\",Teacher6!G8)","v":""},{"$f":"IF(Teacher6!H8=\"\",\"\",Teacher6!H8)","v":"สุขะ4"},{"$f":"IF(Teacher6!I8=\"\",\"\",Teacher6!I8)","v":"ลดเวลาเรียน"},{"$f":"IF(Teacher6!J8=\"\",\"\",Teacher6!J8)","v":""},{"$f":"IF(Teacher6!K8=\"\",\"\",Teacher6!K8)","v":""},{"$f":"IF(Teacher6!L8=\"\",\"\",Teacher6!L8)","v":""},{"$f":"IF(Teacher6!M8=\"\",\"\",Teacher6!M8)","v":""}]
[null,{"$f":"IF(Teacher5!B9=\"\",\"\",Teacher5!B9)","v":""},{"$f":"IF(Teacher5!C9=\"\",\"\",Teacher5!C9)","v":"ป.5/1"},{"$f":"IF(Teacher5!D9=\"\",\"\",Teacher5!D9)","v":""},{"$f":"IF(Teacher5!E9=\"\",\"\",Teacher5!E9)","v":"ป.5/1"},{"$f":"IF(Teacher5!F9=\"\",\"\",Teacher5!F9)","v":""},{"$f":"IF(Teacher5!G9=\"\",\"\",Teacher5!G9)","v":"ป.5/1"},{"$f":"IF(Teacher5!H9=\"\",\"\",Teacher5!H9)","v":"ป.6/1"},{"$f":"IF(Teacher5!I9=\"\",\"\",Teacher5!I9)","v":"ป.1/1"},{"$f":"IF(Teacher5!J9=\"\",\"\",Teacher5!J9)","v":""},{"$f":"IF(Teacher5!K9=\"\",\"\",Teacher5!K9)","v":""},{"$f":"IF(Teacher5!L9=\"\",\"\",Teacher5!L9)","v":""},{"$f":"IF(Teacher5!M9=\"\",\"\",Teacher5!M9)","v":""},null,null,{"$f":"IF(Teacher6!B9=\"\",\"\",Teacher6!B9)","v":""},{"$f":"IF(Teacher6!C9=\"\",\"\",Teacher6!C9)","v":"ป.6/1"},{"$f":"IF(Teacher6!D9=\"\",\"\",Teacher6!D9)","v":"ป.6/1"},{"$f":"IF(Teacher6!E9=\"\",\"\",Teacher6!E9)","v":"ป.6/1"},{"$f":"IF(Teacher6!F9=\"\",\"\",Teacher6!F9)","v":""},{"$f":"IF(Teacher6!G9=\"\",\"\",Teacher6!G9)","v":""},{"$f":"IF(Teacher6!H9=\"\",\"\",Teacher6!H9)","v":"ป.4/1"},{"$f":"IF(Teacher6!I9=\"\",\"\",Teacher6!I9)","v":"ป.6/1"},{"$f":"IF(Teacher6!J9=\"\",\"\",Teacher6!J9)","v":""},{"$f":"IF(Teacher6!K9=\"\",\"\",Teacher6!K9)","v":""},{"$f":"IF(Teacher6!L9=\"\",\"\",Teacher6!L9)","v":""},{"$f":"IF(Teacher6!M9=\"\",\"\",Teacher6!M9)","v":""}]
[{"$f":"IF(Teacher5!A10=\"\",\"\",Teacher5!A10)","v":"อังคาร"},{"$f":"IF(Teacher5!B10=\"\",\"\",Teacher5!B10)","v":""},{"$f":"IF(Teacher5!C10=\"\",\"\",Teacher5!C10)","v":"ท15101"},{"$f":"IF(Teacher5!D10=\"\",\"\",Teacher5!D10)","v":"ค15101"},{"$f":"IF(Teacher5!E10=\"\",\"\",Teacher5!E10)","v":""},{"$f":"IF(Teacher5!F10=\"\",\"\",Teacher5!F10)","v":""},{"$f":"IF(Teacher5!G10=\"\",\"\",Teacher5!G10)","v":"ก15901"},{"$f":"IF(Teacher5!H10=\"\",\"\",Teacher5!H10)","v":"ง15101-1"},{"$f":"IF(Teacher5!I10=\"\",\"\",Teacher5!I10)","v":"ก12905"},{"$f":"IF(Teacher5!J10=\"\",\"\",Teacher5!J10)","v":""},{"$f":"IF(Teacher5!K10=\"\",\"\",Teacher5!K10)","v":""},{"$f":"IF(Teacher5!L10=\"\",\"\",Teacher5!L10)","v":""},{"$f":"IF(Teacher5!M10=\"\",\"\",Teacher5!M10)","v":""},null,{"$f":"IF(Teacher6!A10=\"\",\"\",Teacher6!A10)","v":"อังคาร"},{"$f":"IF(Teacher6!B10=\"\",\"\",Teacher6!B10)","v":""},{"$f":"IF(Teacher6!C10=\"\",\"\",Teacher6!C10)","v":"ค16101"},{"$f":"IF(Teacher6!D10=\"\",\"\",Teacher6!D10)","v":""},{"$f":"IF(Teacher6!E10=\"\",\"\",Teacher6!E10)","v":"ส16102"},{"$f":"IF(Teacher6!F10=\"\",\"\",Teacher6!F10)","v":""},{"$f":"IF(Teacher6!G10=\"\",\"\",Teacher6!G10)","v":""},{"$f":"IF(Teacher6!H10=\"\",\"\",Teacher6!H10)","v":"พ16101-2"},{"$f":"IF(Teacher6!I10=\"\",\"\",Teacher6!I10)","v":"ก16906"},{"$f":"IF(Teacher6!J10=\"\",\"\",Teacher6!J10)","v":""},{"$f":"IF(Teacher6!K10=\"\",\"\",Teacher6!K10)","v":""},{"$f":"IF(Teacher6!L10=\"\",\"\",Teacher6!L10)","v":""},{"$f":"IF(Teacher6!M10=\"\",\"\",Teacher6!M10)","v":""}]
[null,{"$f":"IF(Teacher5!B11=\"\",\"\",Teacher5!B11)","v":"หน้าเสาธง"},{"$f":"IF(Teacher5!C11=\"\",\"\",Teacher5!C11)","v":"ไทย5"},{"$f":"IF(Teacher5!D11=\"\",\"\",Teacher5!D11)","v":"คณิต5"},{"$f":"IF(Teacher5!E11=\"\",\"\",Teacher5!E11)","v":""},{"$f":"IF(Teacher5!F11=\"\",\"\",Teacher5!F11)","v":"พักกลางวัน"},{"$f":"IF(Teacher5!G11=\"\",\"\",Teacher5!G11)","v":"แนะแนว5"},{"$f":"IF(Teacher5!H11=\"\",\"\",Teacher5!H11)","v":"กอท5"},{"$f":"IF(Teacher5!I11=\"\",\"\",Teacher5!I11)","v":"ICT2"},{"$f":"IF(Teacher5!J11=\"\",\"\",Teacher5!J11)","v":""},{"$f":"IF(Teacher5!K11=\"\",\"\",Teacher5!K11)","v":""},{"$f":"IF(Teacher5!L11=\"\",\"\",Teacher5!L11)","v":""},{"$f":"IF(Teacher5!M11=\"\",\"\",Teacher5!M11)","v":""},null,null,{"$f":"IF(Teacher6!B11=\"\",\"\",Teacher6!B11)","v":"หน้าเสาธง"},{"$f":"IF(Teacher6!C11=\"\",\"\",Teacher6!C11)","v":"คณิต6"},{"$f":"IF(Teacher6!D11=\"\",\"\",Teacher6!D11)","v":""},{"$f":"IF(Teacher6!E11=\"\",\"\",Teacher6!E11)","v":"ประวัติ6"},{"$f":"IF(Teacher6!F11=\"\",\"\",Teacher6!F11)","v":"พักกลางวัน"},{"$f":"IF(Teacher6!G11=\"\",\"\",Teacher6!G11)","v":""},{"$f":"IF(Teacher6!H11=\"\",\"\",Teacher6!H11)","v":"พละ6"},{"$f":"IF(Teacher6!I11=\"\",\"\",Teacher6!I11)","v":"ลดเวลาเรียน"},{"$f":"IF(Teacher6!J11=\"\",\"\",Teacher6!J11)","v":""},{"$f":"IF(Teacher6!K11=\"\",\"\",Teacher6!K11)","v":""},{"$f":"IF(Teacher6!L11=\"\",\"\",Teacher6!L11)","v":""},{"$f":"IF(Teacher6!M11=\"\",\"\",Teacher6!M11)","v":""}]
[null,{"$f":"IF(Teacher5!B12=\"\",\"\",Teacher5!B12)","v":""},{"$f":"IF(Teacher5!C12=\"\",\"\",Teacher5!C12)","v":"ป.5/1"},{"$f":"IF(Teacher5!D12=\"\",\"\",Teacher5!D12)","v":"ป.5/1"},{"$f":"IF(Teacher5!E12=\"\",\"\",Teacher5!E12)","v":""},{"$f":"IF(Teacher5!F12=\"\",\"\",Teacher5!F12)","v":""},{"$f":"IF(Teacher5!G12=\"\",\"\",Teacher5!G12)","v":"ป.5/1"},{"$f":"IF(Teacher5!H12=\"\",\"\",Teacher5!H12)","v":"ป.5/1"},{"$f":"IF(Teacher5!I12=\"\",\"\",Teacher5!I12)","v":"ป.2/1"},{"$f":"IF(Teacher5!J12=\"\",\"\",Teacher5!J12)","v":""},{"$f":"IF(Teacher5!K12=\"\",\"\",Teacher5!K12)","v":""},{"$f":"IF(Teacher5!L12=\"\",\"\",Teacher5!L12)","v":""},{"$f":"IF(Teacher5!M12=\"\",\"\",Teacher5!M12)","v":""},null,null,{"$f":"IF(Teacher6!B12=\"\",\"\",Teacher6!B12)","v":""},{"$f":"IF(Teacher6!C12=\"\",\"\",Teacher6!C12)","v":"ป.6/1"},{"$f":"IF(Teacher6!D12=\"\",\"\",Teacher6!D12)","v":""},{"$f":"IF(Teacher6!E12=\"\",\"\",Teacher6!E12)","v":"ป.6/1"},{"$f":"IF(Teacher6!F12=\"\",\"\",Teacher6!F12)","v":""},{"$f":"IF(Teacher6!G12=\"\",\"\",Teacher6!G12)","v":""},{"$f":"IF(Teacher6!H12=\"\",\"\",Teacher6!H12)","v":"ป.6/1"},{"$f":"IF(Teacher6!I12=\"\",\"\",Teacher6!I12)","v":"ป.6/1"},{"$f":"IF(Teacher6!J12=\"\",\"\",Teacher6!J12)","v":""},{"$f":"IF(Teacher6!K12=\"\",\"\",Teacher6!K12)","v":""},{"$f":"IF(Teacher6!L12=\"\",\"\",Teacher6!L12)","v":""},{"$f":"IF(Teacher6!M12=\"\",\"\",Teacher6!M12)","v":""}]
[{"$f":"IF(Teacher5!A13=\"\",\"\",Teacher5!A13)","v":"พุธ"},{"$f":"IF(Teacher5!B13=\"\",\"\",Teacher5!B13)","v":""},{"$f":"IF(Teacher5!C13=\"\",\"\",Teacher5!C13)","v":""},{"$f":"IF(Teacher5!D13=\"\",\"\",Teacher5!D13)","v":"ค15101"},{"$f":"IF(Teacher5!E13=\"\",\"\",Teacher5!E13)","v":"ท15101"},{"$f":"IF(Teacher5!F13=\"\",\"\",Teacher5!F13)","v":""},{"$f":"IF(Teacher5!G13=\"\",\"\",Teacher5!G13)","v":"ง14101-2"},{"$f":"IF(Teacher5!H13=\"\",\"\",Teacher5!H13)","v":"ก15902"},{"$f":"IF(Teacher5!I13=\"\",\"\",Teacher5!I13)","v":"ก12905"},{"$f":"IF(Teacher5!J13=\"\",\"\",Teacher5!J13)","v":""},{"$f":"IF(Teacher5!K13=\"\",\"\",Teacher5!K13)","v":""},{"$f":"IF(Teacher5!L13=\"\",\"\",Teacher5!L13)","v":""},{"$f":"IF(Teacher5!M13=\"\",\"\",Teacher5!M13)","v":""},null,{"$f":"IF(Teacher6!A13=\"\",\"\",Teacher6!A13)","v":"พุธ"},{"$f":"IF(Teacher6!B13=\"\",\"\",Teacher6!B13)","v":""},{"$f":"IF(Teacher6!C13=\"\",\"\",Teacher6!C13)","v":"ส16101"},{"$f":"IF(Teacher6!D13=\"\",\"\",Teacher6!D13)","v":"ท16101"},{"$f":"IF(Teacher6!E13=\"\",\"\",Teacher6!E13)","v":"ก16901"},{"$f":"IF(Teacher6!F13=\"\",\"\",Teacher6!F13)","v":""},{"$f":"IF(Teacher6!G13=\"\",\"\",Teacher6!G13)","v":"พ15101-1"},{"$f":"IF(Teacher6!H13=\"\",\"\",Teacher6!H13)","v":"ก16902"},{"$f":"IF(Teacher6!I13=\"\",\"\",Teacher6!I13)","v":"ก16906"},{"$f":"IF(Teacher6!J13=\"\",\"\",Teacher6!J13)","v":""},{"$f":"IF(Teacher6!K13=\"\",\"\",Teacher6!K13)","v":""},{"$f":"IF(Teacher6!L13=\"\",\"\",Teacher6!L13)","v":""},{"$f":"IF(Teacher6!M13=\"\",\"\",Teacher6!M13)","v":""}]
[null,{"$f":"IF(Teacher5!B14=\"\",\"\",Teacher5!B14)","v":"หน้าเสาธง"},{"$f":"IF(Teacher5!C14=\"\",\"\",Teacher5!C14)","v":""},{"$f":"IF(Teacher5!D14=\"\",\"\",Teacher5!D14)","v":"คณิต5"},{"$f":"IF(Teacher5!E14=\"\",\"\",Teacher5!E14)","v":"ไทย5"},{"$f":"IF(Teacher5!F14=\"\",\"\",Teacher5!F14)","v":"พักกลางวัน"},{"$f":"IF(Teacher5!G14=\"\",\"\",Teacher5!G14)","v":"คอมพิวเตอร์"},{"$f":"IF(Teacher5!H14=\"\",\"\",Teacher5!H14)","v":"ลูกเสือ5"},{"$f":"IF(Teacher5!I14=\"\",\"\",Teacher5!I14)","v":"ICT2"},{"$f":"IF(Teacher5!J14=\"\",\"\",Teacher5!J14)","v":""},{"$f":"IF(Teacher5!K14=\"\",\"\",Teacher5!K14)","v":""},{"$f":"IF(Teacher5!L14=\"\",\"\",Teacher5!L14)","v":""},{"$f":"IF(Teacher5!M14=\"\",\"\",Teacher5!M14)","v":""},null,null,{"$f":"IF(Teacher6!B14=\"\",\"\",Teacher6!B14)","v":"หน้าเสาธง"},{"$f":"IF(Teacher6!C14=\"\",\"\",Teacher6!C14)","v":"สังคม6"},{"$f":"IF(Teacher6!D14=\"\",\"\",Teacher6!D14)","v":"ไทย6"},{"$f":"IF(Teacher6!E14=\"\",\"\",Teacher6!E14)","v":"แนะแนว6"},{"$f":"IF(Teacher6!F14=\"\",\"\",Teacher6!F14)","v":"พักกลางวัน"},{"$f":"IF(Teacher6!G14=\"\",\"\",Teacher6!G14)","v":"สุขะ5"},{"$f":"IF(Teacher6!H14=\"\",\"\",Teacher6!H14)","v":"ลูกเสือ6"},{"$f":"IF(Teacher6!I14=\"\",\"\",Teacher6!I14)","v":"ลดเวลาเรียน"},{"$f":"IF(Teacher6!J14=\"\",\"\",Teacher6!J14)","v":""},{"$f":"IF(Teacher6!K14=\"\",\"\",Teacher6!K14)","v":""},{"$f":"IF(Teacher6!L14=\"\",\"\",Teacher6!L14)","v":""},{"$f":"IF(Teacher6!M14=\"\",\"\",Teacher6!M14)","v":""}]
[null,{"$f":"IF(Teacher5!B15=\"\",\"\",Teacher5!B15)","v":""},{"$f":"IF(Teacher5!C15=\"\",\"\",Teacher5!C15)","v":""},{"$f":"IF(Teacher5!D15=\"\",\"\",Teacher5!D15)","v":"ป.5/1"},{"$f":"IF(Teacher5!E15=\"\",\"\",Teacher5!E15)","v":"ป.5/1"},{"$f":"IF(Teacher5!F15=\"\",\"\",Teacher5!F15)","v":""},{"$f":"IF(Teacher5!G15=\"\",\"\",Teacher5!G15)","v":"ป.4/1"},{"$f":"IF(Teacher5!H15=\"\",\"\",Teacher5!H15)","v":"ป.5/1"},{"$f":"IF(Teacher5!I15=\"\",\"\",Teacher5!I15)","v":"ป.3/1"},{"$f":"IF(Teacher5!J15=\"\",\"\",Teacher5!J15)","v":""},{"$f":"IF(Teacher5!K15=\"\",\"\",Teacher5!K15)","v":""},{"$f":"IF(Teacher5!L15=\"\",\"\",Teacher5!L15)","v":""},{"$f":"IF(Teacher5!M15=\"\",\"\",Teacher5!M15)","v":""},null,null,{"$f":"IF(Teacher6!B15=\"\",\"\",Teacher6!B15)","v":""},{"$f":"IF(Teacher6!C15=\"\",\"\",Teacher6!C15)","v":"ป.6/1"},{"$f":"IF(Teacher6!D15=\"\",\"\",Teacher6!D15)","v":"ป.6/1"},{"$f":"IF(Teacher6!E15=\"\",\"\",Teacher6!E15)","v":"ป.6/1"},{"$f":"IF(Teacher6!F15=\"\",\"\",Teacher6!F15)","v":""},{"$f":"IF(Teacher6!G15=\"\",\"\",Teacher6!G15)","v":"ป.5/1"},{"$f":"IF(Teacher6!H15=\"\",\"\",Teacher6!H15)","v":"ป.6/1"},{"$f":"IF(Teacher6!I15=\"\",\"\",Teacher6!I15)","v":"ป.6/1"},{"$f":"IF(Teacher6!J15=\"\",\"\",Teacher6!J15)","v":""},{"$f":"IF(Teacher6!K15=\"\",\"\",Teacher6!K15)","v":""},{"$f":"IF(Teacher6!L15=\"\",\"\",Teacher6!L15)","v":""},{"$f":"IF(Teacher6!M15=\"\",\"\",Teacher6!M15)","v":""}]
[{"$f":"IF(Teacher5!A16=\"\",\"\",Teacher5!A16)","v":"พฤหัสบดี"},{"$f":"IF(Teacher5!B16=\"\",\"\",Teacher5!B16)","v":""},{"$f":"IF(Teacher5!C16=\"\",\"\",Teacher5!C16)","v":"ท15101"},{"$f":"IF(Teacher5!D16=\"\",\"\",Teacher5!D16)","v":""},{"$f":"IF(Teacher5!E16=\"\",\"\",Teacher5!E16)","v":"ง15101-2"},{"$f":"IF(Teacher5!F16=\"\",\"\",Teacher5!F16)","v":""},{"$f":"IF(Teacher5!G16=\"\",\"\",Teacher5!G16)","v":""},{"$f":"IF(Teacher5!H16=\"\",\"\",Teacher5!H16)","v":"ง16101-1"},{"$f":"IF(Teacher5!I16=\"\",\"\",Teacher5!I16)","v":"ก15906-2"},{"$f":"IF(Teacher5!J16=\"\",\"\",Teacher5!J16)","v":""},{"$f":"IF(Teacher5!K16=\"\",\"\",Teacher5!K16)","v":""},{"$f":"IF(Teacher5!L16=\"\",\"\",Teacher5!L16)","v":""},{"$f":"IF(Teacher5!M16=\"\",\"\",Teacher5!M16)","v":""},null,{"$f":"IF(Teacher6!A16=\"\",\"\",Teacher6!A16)","v":"พฤหัสบดี"},{"$f":"IF(Teacher6!B16=\"\",\"\",Teacher6!B16)","v":""},{"$f":"IF(Teacher6!C16=\"\",\"\",Teacher6!C16)","v":"ค16101"},{"$f":"IF(Teacher6!D16=\"\",\"\",Teacher6!D16)","v":"ท16101"},{"$f":"IF(Teacher6!E16=\"\",\"\",Teacher6!E16)","v":""},{"$f":"IF(Teacher6!F16=\"\",\"\",Teacher6!F16)","v":""},{"$f":"IF(Teacher6!G16=\"\",\"\",Teacher6!G16)","v":"พ14101-2"},{"$f":"IF(Teacher6!H16=\"\",\"\",Teacher6!H16)","v":"พ15101-2"},{"$f":"IF(Teacher6!I16=\"\",\"\",Teacher6!I16)","v":"ก16906"},{"$f":"IF(Teacher6!J16=\"\",\"\",Teacher6!J16)","v":""},{"$f":"IF(Teacher6!K16=\"\",\"\",Teacher6!K16)","v":""},{"$f":"IF(Teacher6!L16=\"\",\"\",Teacher6!L16)","v":""},{"$f":"IF(Teacher6!M16=\"\",\"\",Teacher6!M16)","v":""}]
[null,{"$f":"IF(Teacher5!B17=\"\",\"\",Teacher5!B17)","v":"หน้าเสาธง"},{"$f":"IF(Teacher5!C17=\"\",\"\",Teacher5!C17)","v":"ไทย5"},{"$f":"IF(Teacher5!D17=\"\",\"\",Teacher5!D17)","v":""},{"$f":"IF(Teacher5!E17=\"\",\"\",Teacher5!E17)","v":"คอมพิวเตอร์"},{"$f":"IF(Teacher5!F17=\"\",\"\",Teacher5!F17)","v":"พักกลางวัน"},{"$f":"IF(Teacher5!G17=\"\",\"\",Teacher5!G17)","v":""},{"$f":"IF(Teacher5!H17=\"\",\"\",Teacher5!H17)","v":"กอท6"},{"$f":"IF(Teacher5!I17=\"\",\"\",Teacher5!I17)","v":"ลดเวลาเรียน"},{"$f":"IF(Teacher5!J17=\"\",\"\",Teacher5!J17)","v":""},{"$f":"IF(Teacher5!K17=\"\",\"\",Teacher5!K17)","v":""},{"$f":"IF(Teacher5!L17=\"\",\"\",Teacher5!L17)","v":""},{"$f":"IF(Teacher5!M17=\"\",\"\",Teacher5!M17)","v":""},null,null,{"$f":"IF(Teacher6!B17=\"\",\"\",Teacher6!B17)","v":"หน้าเสาธง"},{"$f":"IF(Teacher6!C17=\"\",\"\",Teacher6!C17)","v":"คณิต6"},{"$f":"IF(Teacher6!D17=\"\",\"\",Teacher6!D17)","v":"ไทย6"},{"$f":"IF(Teacher6!E17=\"\",\"\",Teacher6!E17)","v":""},{"$f":"IF(Teacher6!F17=\"\",\"\",Teacher6!F17)","v":"พักกลางวัน"},{"$f":"IF(Teacher6!G17=\"\",\"\",Teacher6!G17)","v":"พละ4"},{"$f":"IF(Teacher6!H17=\"\",\"\",Teacher6!H17)","v":"พละ5"},{"$f":"IF(Teacher6!I17=\"\",\"\",Teacher6!I17)","v":"ลดเวลาเรียน"},{"$f":"IF(Teacher6!J17=\"\",\"\",Teacher6!J17)","v":""},{"$f":"IF(Teacher6!K17=\"\",\"\",Teacher6!K17)","v":""},{"$f":"IF(Teacher6!L17=\"\",\"\",Teacher6!L17)","v":""},{"$f":"IF(Teacher6!M17=\"\",\"\",Teacher6!M17)","v":""}]
[null,{"$f":"IF(Teacher5!B18=\"\",\"\",Teacher5!B18)","v":""},{"$f":"IF(Teacher5!C18=\"\",\"\",Teacher5!C18)","v":"ป.5/1"},{"$f":"IF(Teacher5!D18=\"\",\"\",Teacher5!D18)","v":""},{"$f":"IF(Teacher5!E18=\"\",\"\",Teacher5!E18)","v":"ป.5/1"},{"$f":"IF(Teacher5!F18=\"\",\"\",Teacher5!F18)","v":""},{"$f":"IF(Teacher5!G18=\"\",\"\",Teacher5!G18)","v":""},{"$f":"IF(Teacher5!H18=\"\",\"\",Teacher5!H18)","v":"ป.6/1"},{"$f":"IF(Teacher5!I18=\"\",\"\",Teacher5!I18)","v":"ป.5/1"},{"$f":"IF(Teacher5!J18=\"\",\"\",Teacher5!J18)","v":""},{"$f":"IF(Teacher5!K18=\"\",\"\",Teacher5!K18)","v":""},{"$f":"IF(Teacher5!L18=\"\",\"\",Teacher5!L18)","v":""},{"$f":"IF(Teacher5!M18=\"\",\"\",Teacher5!M18)","v":""},null,null,{"$f":"IF(Teacher6!B18=\"\",\"\",Teacher6!B18)","v":""},{"$f":"IF(Teacher6!C18=\"\",\"\",Teacher6!C18)","v":"ป.6/1"},{"$f":"IF(Teacher6!D18=\"\",\"\",Teacher6!D18)","v":"ป.6/1"},{"$f":"IF(Teacher6!E18=\"\",\"\",Teacher6!E18)","v":""},{"$f":"IF(Teacher6!F18=\"\",\"\",Teacher6!F18)","v":""},{"$f":"IF(Teacher6!G18=\"\",\"\",Teacher6!G18)","v":"ป.4/1"},{"$f":"IF(Teacher6!H18=\"\",\"\",Teacher6!H18)","v":"ป.5/1"},{"$f":"IF(Teacher6!I18=\"\",\"\",Teacher6!I18)","v":"ป.6/1"},{"$f":"IF(Teacher6!J18=\"\",\"\",Teacher6!J18)","v":""},{"$f":"IF(Teacher6!K18=\"\",\"\",Teacher6!K18)","v":""},{"$f":"IF(Teacher6!L18=\"\",\"\",Teacher6!L18)","v":""},{"$f":"IF(Teacher6!M18=\"\",\"\",Teacher6!M18)","v":""}]
[{"$f":"IF(Teacher5!A19=\"\",\"\",Teacher5!A19)","v":"ศุกร์"},{"$f":"IF(Teacher5!B19=\"\",\"\",Teacher5!B19)","v":""},{"$f":"IF(Teacher5!C19=\"\",\"\",Teacher5!C19)","v":"ค15101"},{"$f":"IF(Teacher5!D19=\"\",\"\",Teacher5!D19)","v":""},{"$f":"IF(Teacher5!E19=\"\",\"\",Teacher5!E19)","v":""},{"$f":"IF(Teacher5!F19=\"\",\"\",Teacher5!F19)","v":""},{"$f":"IF(Teacher5!G19=\"\",\"\",Teacher5!G19)","v":"ศ15101-1"},{"$f":"IF(Teacher5!H19=\"\",\"\",Teacher5!H19)","v":"ก15903"},{"$f":"IF(Teacher5!I19=\"\",\"\",Teacher5!I19)","v":"ก15906-2"},{"$f":"IF(Teacher5!J19=\"\",\"\",Teacher5!J19)","v":""},{"$f":"IF(Teacher5!K19=\"\",\"\",Teacher5!K19)","v":""},{"$f":"IF(Teacher5!L19=\"\",\"\",Teacher5!L19)","v":""},{"$f":"IF(Teacher5!M19=\"\",\"\",Teacher5!M19)","v":""},null,{"$f":"IF(Teacher6!A19=\"\",\"\",Teacher6!A19)","v":"ศุกร์"},{"$f":"IF(Teacher6!B19=\"\",\"\",Teacher6!B19)","v":""},{"$f":"IF(Teacher6!C19=\"\",\"\",Teacher6!C19)","v":"ท16101"},{"$f":"IF(Teacher6!D19=\"\",\"\",Teacher6!D19)","v":"ค16101"},{"$f":"IF(Teacher6!E19=\"\",\"\",Teacher6!E19)","v":"พ16101-1"},{"$f":"IF(Teacher6!F19=\"\",\"\",Teacher6!F19)","v":""},{"$f":"IF(Teacher6!G19=\"\",\"\",Teacher6!G19)","v":""},{"$f":"IF(Teacher6!H19=\"\",\"\",Teacher6!H19)","v":"ก16903"},{"$f":"IF(Teacher6!I19=\"\",\"\",Teacher6!I19)","v":"ก16906"},{"$f":"IF(Teacher6!J19=\"\",\"\",Teacher6!J19)","v":""},{"$f":"IF(Teacher6!K19=\"\",\"\",Teacher6!K19)","v":""},{"$f":"IF(Teacher6!L19=\"\",\"\",Teacher6!L19)","v":""},{"$f":"IF(Teacher6!M19=\"\",\"\",Teacher6!M19)","v":""}]
[null,{"$f":"IF(Teacher5!B20=\"\",\"\",Teacher5!B20)","v":"หน้าเสาธง"},{"$f":"IF(Teacher5!C20=\"\",\"\",Teacher5!C20)","v":"คณิต5"},{"$f":"IF(Teacher5!D20=\"\",\"\",Teacher5!D20)","v":""},{"$f":"IF(Teacher5!E20=\"\",\"\",Teacher5!E20)","v":""},{"$f":"IF(Teacher5!F20=\"\",\"\",Teacher5!F20)","v":"พักกลางวัน"},{"$f":"IF(Teacher5!G20=\"\",\"\",Teacher5!G20)","v":"ศิลปะ5"},{"$f":"IF(Teacher5!H20=\"\",\"\",Teacher5!H20)","v":"ชุมนุม5"},{"$f":"IF(Teacher5!I20=\"\",\"\",Teacher5!I20)","v":"ลดเวลาเรียน"},{"$f":"IF(Teacher5!J20=\"\",\"\",Teacher5!J20)","v":""},{"$f":"IF(Teacher5!K20=\"\",\"\",Teacher5!K20)","v":""},{"$f":"IF(Teacher5!L20=\"\",\"\",Teacher5!L20)","v":""},{"$f":"IF(Teacher5!M20=\"\",\"\",Teacher5!M20)","v":""},null,null,{"$f":"IF(Teacher6!B20=\"\",\"\",Teacher6!B20)","v":"หน้าเสาธง"},{"$f":"IF(Teacher6!C20=\"\",\"\",Teacher6!C20)","v":"ไทย6"},{"$f":"IF(Teacher6!D20=\"\",\"\",Teacher6!D20)","v":"คณิต6"},{"$f":"IF(Teacher6!E20=\"\",\"\",Teacher6!E20)","v":"สุขะ6"},{"$f":"IF(Teacher6!F20=\"\",\"\",Teacher6!F20)","v":"พักกลางวัน"},{"$f":"IF(Teacher6!G20=\"\",\"\",Teacher6!G20)","v":""},{"$f":"IF(Teacher6!H20=\"\",\"\",Teacher6!H20)","v":"ชุมนุม6"},{"$f":"IF(Teacher6!I20=\"\",\"\",Teacher6!I20)","v":"ลดเวลาเรียน"},{"$f":"IF(Teacher6!J20=\"\",\"\",Teacher6!J20)","v":""},{"$f":"IF(Teacher6!K20=\"\",\"\",Teacher6!K20)","v":""},{"$f":"IF(Teacher6!L20=\"\",\"\",Teacher6!L20)","v":""},{"$f":"IF(Teacher6!M20=\"\",\"\",Teacher6!M20)","v":""}]
[null,{"$f":"IF(Teacher5!B21=\"\",\"\",Teacher5!B21)","v":""},{"$f":"IF(Teacher5!C21=\"\",\"\",Teacher5!C21)","v":"ป.5/1"},{"$f":"IF(Teacher5!D21=\"\",\"\",Teacher5!D21)","v":""},{"$f":"IF(Teacher5!E21=\"\",\"\",Teacher5!E21)","v":""},{"$f":"IF(Teacher5!F21=\"\",\"\",Teacher5!F21)","v":""},{"$f":"IF(Teacher5!G21=\"\",\"\",Teacher5!G21)","v":"ป.5/1"},{"$f":"IF(Teacher5!H21=\"\",\"\",Teacher5!H21)","v":"ป.5/1"},{"$f":"IF(Teacher5!I21=\"\",\"\",Teacher5!I21)","v":"ป.5/1"},{"$f":"IF(Teacher5!J21=\"\",\"\",Teacher5!J21)","v":""},{"$f":"IF(Teacher5!K21=\"\",\"\",Teacher5!K21)","v":""},{"$f":"IF(Teacher5!L21=\"\",\"\",Teacher5!L21)","v":""},{"$f":"IF(Teacher5!M21=\"\",\"\",Teacher5!M21)","v":""},null,null,{"$f":"IF(Teacher6!B21=\"\",\"\",Teacher6!B21)","v":""},{"$f":"IF(Teacher6!C21=\"\",\"\",Teacher6!C21)","v":"ป.6/1"},{"$f":"IF(Teacher6!D21=\"\",\"\",Teacher6!D21)","v":"ป.6/1"},{"$f":"IF(Teacher6!E21=\"\",\"\",Teacher6!E21)","v":"ป.6/1"},{"$f":"IF(Teacher6!F21=\"\",\"\",Teacher6!F21)","v":""},{"$f":"IF(Teacher6!G21=\"\",\"\",Teacher6!G21)","v":""},{"$f":"IF(Teacher6!H21=\"\",\"\",Teacher6!H21)","v":"ป.6/1"},{"$f":"IF(Teacher6!I21=\"\",\"\",Teacher6!I21)","v":"ป.6/1"},{"$f":"IF(Teacher6!J21=\"\",\"\",Teacher6!J21)","v":""},{"$f":"IF(Teacher6!K21=\"\",\"\",Teacher6!K21)","v":""},{"$f":"IF(Teacher6!L21=\"\",\"\",Teacher6!L21)","v":""},{"$f":"IF(Teacher6!M21=\"\",\"\",Teacher6!M21)","v":""}]
[{"$f":"IF(Teacher5!A22=\"\",\"\",Teacher5!A22)","v":"เสาร์"},{"$f":"IF(Teacher5!B22=\"\",\"\",Teacher5!B22)","v":""},{"$f":"IF(Teacher5!C22=\"\",\"\",Teacher5!C22)","v":""},{"$f":"IF(Teacher5!D22=\"\",\"\",Teacher5!D22)","v":""},{"$f":"IF(Teacher5!E22=\"\",\"\",Teacher5!E22)","v":""},{"$f":"IF(Teacher5!F22=\"\",\"\",Teacher5!F22)","v":""},{"$f":"IF(Teacher5!G22=\"\",\"\",Teacher5!G22)","v":""},{"$f":"IF(Teacher5!H22=\"\",\"\",Teacher5!H22)","v":""},{"$f":"IF(Teacher5!I22=\"\",\"\",Teacher5!I22)","v":""},{"$f":"IF(Teacher5!J22=\"\",\"\",Teacher5!J22)","v":""},{"$f":"IF(Teacher5!K22=\"\",\"\",Teacher5!K22)","v":""},{"$f":"IF(Teacher5!L22=\"\",\"\",Teacher5!L22)","v":""},{"$f":"IF(Teacher5!M22=\"\",\"\",Teacher5!M22)","v":""},null,{"$f":"IF(Teacher6!A22=\"\",\"\",Teacher6!A22)","v":"เสาร์"},{"$f":"IF(Teacher6!B22=\"\",\"\",Teacher6!B22)","v":""},{"$f":"IF(Teacher6!C22=\"\",\"\",Teacher6!C22)","v":""},{"$f":"IF(Teacher6!D22=\"\",\"\",Teacher6!D22)","v":""},{"$f":"IF(Teacher6!E22=\"\",\"\",Teacher6!E22)","v":""},{"$f":"IF(Teacher6!F22=\"\",\"\",Teacher6!F22)","v":""},{"$f":"IF(Teacher6!G22=\"\",\"\",Teacher6!G22)","v":""},{"$f":"IF(Teacher6!H22=\"\",\"\",Teacher6!H22)","v":""},{"$f":"IF(Teacher6!I22=\"\",\"\",Teacher6!I22)","v":""},{"$f":"IF(Teacher6!J22=\"\",\"\",Teacher6!J22)","v":""},{"$f":"IF(Teacher6!K22=\"\",\"\",Teacher6!K22)","v":""},{"$f":"IF(Teacher6!L22=\"\",\"\",Teacher6!L22)","v":""},{"$f":"IF(Teacher6!M22=\"\",\"\",Teacher6!M22)","v":""}]
[null,{"$f":"IF(Teacher5!B23=\"\",\"\",Teacher5!B23)","v":""},{"$f":"IF(Teacher5!C23=\"\",\"\",Teacher5!C23)","v":""},{"$f":"IF(Teacher5!D23=\"\",\"\",Teacher5!D23)","v":""},{"$f":"IF(Teacher5!E23=\"\",\"\",Teacher5!E23)","v":""},{"$f":"IF(Teacher5!F23=\"\",\"\",Teacher5!F23)","v":""},{"$f":"IF(Teacher5!G23=\"\",\"\",Teacher5!G23)","v":""},{"$f":"IF(Teacher5!H23=\"\",\"\",Teacher5!H23)","v":""},{"$f":"IF(Teacher5!I23=\"\",\"\",Teacher5!I23)","v":""},{"$f":"IF(Teacher5!J23=\"\",\"\",Teacher5!J23)","v":""},{"$f":"IF(Teacher5!K23=\"\",\"\",Teacher5!K23)","v":""},{"$f":"IF(Teacher5!L23=\"\",\"\",Teacher5!L23)","v":""},{"$f":"IF(Teacher5!M23=\"\",\"\",Teacher5!M23)","v":""},null,null,{"$f":"IF(Teacher6!B23=\"\",\"\",Teacher6!B23)","v":""},{"$f":"IF(Teacher6!C23=\"\",\"\",Teacher6!C23)","v":""},{"$f":"IF(Teacher6!D23=\"\",\"\",Teacher6!D23)","v":""},{"$f":"IF(Teacher6!E23=\"\",\"\",Teacher6!E23)","v":""},{"$f":"IF(Teacher6!F23=\"\",\"\",Teacher6!F23)","v":""},{"$f":"IF(Teacher6!G23=\"\",\"\",Teacher6!G23)","v":""},{"$f":"IF(Teacher6!H23=\"\",\"\",Teacher6!H23)","v":""},{"$f":"IF(Teacher6!I23=\"\",\"\",Teacher6!I23)","v":""},{"$f":"IF(Teacher6!J23=\"\",\"\",Teacher6!J23)","v":""},{"$f":"IF(Teacher6!K23=\"\",\"\",Teacher6!K23)","v":""},{"$f":"IF(Teacher6!L23=\"\",\"\",Teacher6!L23)","v":""},{"$f":"IF(Teacher6!M23=\"\",\"\",Teacher6!M23)","v":""}]
[null,{"$f":"IF(Teacher5!B24=\"\",\"\",Teacher5!B24)","v":""},{"$f":"IF(Teacher5!C24=\"\",\"\",Teacher5!C24)","v":""},{"$f":"IF(Teacher5!D24=\"\",\"\",Teacher5!D24)","v":""},{"$f":"IF(Teacher5!E24=\"\",\"\",Teacher5!E24)","v":""},{"$f":"IF(Teacher5!F24=\"\",\"\",Teacher5!F24)","v":""},{"$f":"IF(Teacher5!G24=\"\",\"\",Teacher5!G24)","v":""},{"$f":"IF(Teacher5!H24=\"\",\"\",Teacher5!H24)","v":""},{"$f":"IF(Teacher5!I24=\"\",\"\",Teacher5!I24)","v":""},{"$f":"IF(Teacher5!J24=\"\",\"\",Teacher5!J24)","v":""},{"$f":"IF(Teacher5!K24=\"\",\"\",Teacher5!K24)","v":""},{"$f":"IF(Teacher5!L24=\"\",\"\",Teacher5!L24)","v":""},{"$f":"IF(Teacher5!M24=\"\",\"\",Teacher5!M24)","v":""},null,null,{"$f":"IF(Teacher6!B24=\"\",\"\",Teacher6!B24)","v":""},{"$f":"IF(Teacher6!C24=\"\",\"\",Teacher6!C24)","v":""},{"$f":"IF(Teacher6!D24=\"\",\"\",Teacher6!D24)","v":""},{"$f":"IF(Teacher6!E24=\"\",\"\",Teacher6!E24)","v":""},{"$f":"IF(Teacher6!F24=\"\",\"\",Teacher6!F24)","v":""},{"$f":"IF(Teacher6!G24=\"\",\"\",Teacher6!G24)","v":""},{"$f":"IF(Teacher6!H24=\"\",\"\",Teacher6!H24)","v":""},{"$f":"IF(Teacher6!I24=\"\",\"\",Teacher6!I24)","v":""},{"$f":"IF(Teacher6!J24=\"\",\"\",Teacher6!J24)","v":""},{"$f":"IF(Teacher6!K24=\"\",\"\",Teacher6!K24)","v":""},{"$f":"IF(Teacher6!L24=\"\",\"\",Teacher6!L24)","v":""},{"$f":"IF(Teacher6!M24=\"\",\"\",Teacher6!M24)","v":""}]
[{"$f":"IF(Teacher5!A25=\"\",\"\",Teacher5!A25)","v":"อาทิตย์"},{"$f":"IF(Teacher5!B25=\"\",\"\",Teacher5!B25)","v":""},{"$f":"IF(Teacher5!C25=\"\",\"\",Teacher5!C25)","v":""},{"$f":"IF(Teacher5!D25=\"\",\"\",Teacher5!D25)","v":""},{"$f":"IF(Teacher5!E25=\"\",\"\",Teacher5!E25)","v":""},{"$f":"IF(Teacher5!F25=\"\",\"\",Teacher5!F25)","v":""},{"$f":"IF(Teacher5!G25=\"\",\"\",Teacher5!G25)","v":""},{"$f":"IF(Teacher5!H25=\"\",\"\",Teacher5!H25)","v":""},{"$f":"IF(Teacher5!I25=\"\",\"\",Teacher5!I25)","v":""},{"$f":"IF(Teacher5!J25=\"\",\"\",Teacher5!J25)","v":""},{"$f":"IF(Teacher5!K25=\"\",\"\",Teacher5!K25)","v":""},{"$f":"IF(Teacher5!L25=\"\",\"\",Teacher5!L25)","v":""},{"$f":"IF(Teacher5!M25=\"\",\"\",Teacher5!M25)","v":""},null,{"$f":"IF(Teacher6!A25=\"\",\"\",Teacher6!A25)","v":"อาทิตย์"},{"$f":"IF(Teacher6!B25=\"\",\"\",Teacher6!B25)","v":""},{"$f":"IF(Teacher6!C25=\"\",\"\",Teacher6!C25)","v":""},{"$f":"IF(Teacher6!D25=\"\",\"\",Teacher6!D25)","v":""},{"$f":"IF(Teacher6!E25=\"\",\"\",Teacher6!E25)","v":""},{"$f":"IF(Teacher6!F25=\"\",\"\",Teacher6!F25)","v":""},{"$f":"IF(Teacher6!G25=\"\",\"\",Teacher6!G25)","v":""},{"$f":"IF(Teacher6!H25=\"\",\"\",Teacher6!H25)","v":""},{"$f":"IF(Teacher6!I25=\"\",\"\",Teacher6!I25)","v":""},{"$f":"IF(Teacher6!J25=\"\",\"\",Teacher6!J25)","v":""},{"$f":"IF(Teacher6!K25=\"\",\"\",Teacher6!K25)","v":""},{"$f":"IF(Teacher6!L25=\"\",\"\",Teacher6!L25)","v":""},{"$f":"IF(Teacher6!M25=\"\",\"\",Teacher6!M25)","v":""}]
[null,{"$f":"IF(Teacher5!B26=\"\",\"\",Teacher5!B26)","v":""},{"$f":"IF(Teacher5!C26=\"\",\"\",Teacher5!C26)","v":""},{"$f":"IF(Teacher5!D26=\"\",\"\",Teacher5!D26)","v":""},{"$f":"IF(Teacher5!E26=\"\",\"\",Teacher5!E26)","v":""},{"$f":"IF(Teacher5!F26=\"\",\"\",Teacher5!F26)","v":""},{"$f":"IF(Teacher5!G26=\"\",\"\",Teacher5!G26)","v":""},{"$f":"IF(Teacher5!H26=\"\",\"\",Teacher5!H26)","v":""},{"$f":"IF(Teacher5!I26=\"\",\"\",Teacher5!I26)","v":""},{"$f":"IF(Teacher5!J26=\"\",\"\",Teacher5!J26)","v":""},{"$f":"IF(Teacher5!K26=\"\",\"\",Teacher5!K26)","v":""},{"$f":"IF(Teacher5!L26=\"\",\"\",Teacher5!L26)","v":""},{"$f":"IF(Teacher5!M26=\"\",\"\",Teacher5!M26)","v":""},null,null,{"$f":"IF(Teacher6!B26=\"\",\"\",Teacher6!B26)","v":""},{"$f":"IF(Teacher6!C26=\"\",\"\",Teacher6!C26)","v":""},{"$f":"IF(Teacher6!D26=\"\",\"\",Teacher6!D26)","v":""},{"$f":"IF(Teacher6!E26=\"\",\"\",Teacher6!E26)","v":""},{"$f":"IF(Teacher6!F26=\"\",\"\",Teacher6!F26)","v":""},{"$f":"IF(Teacher6!G26=\"\",\"\",Teacher6!G26)","v":""},{"$f":"IF(Teacher6!H26=\"\",\"\",Teacher6!H26)","v":""},{"$f":"IF(Teacher6!I26=\"\",\"\",Teacher6!I26)","v":""},{"$f":"IF(Teacher6!J26=\"\",\"\",Teacher6!J26)","v":""},{"$f":"IF(Teacher6!K26=\"\",\"\",Teacher6!K26)","v":""},{"$f":"IF(Teacher6!L26=\"\",\"\",Teacher6!L26)","v":""},{"$f":"IF(Teacher6!M26=\"\",\"\",Teacher6!M26)","v":""}]
[null,{"$f":"IF(Teacher5!B27=\"\",\"\",Teacher5!B27)","v":""},{"$f":"IF(Teacher5!C27=\"\",\"\",Teacher5!C27)","v":""},{"$f":"IF(Teacher5!D27=\"\",\"\",Teacher5!D27)","v":""},{"$f":"IF(Teacher5!E27=\"\",\"\",Teacher5!E27)","v":""},{"$f":"IF(Teacher5!F27=\"\",\"\",Teacher5!F27)","v":""},{"$f":"IF(Teacher5!G27=\"\",\"\",Teacher5!G27)","v":""},{"$f":"IF(Teacher5!H27=\"\",\"\",Teacher5!H27)","v":""},{"$f":"IF(Teacher5!I27=\"\",\"\",Teacher5!I27)","v":""},{"$f":"IF(Teacher5!J27=\"\",\"\",Teacher5!J27)","v":""},{"$f":"IF(Teacher5!K27=\"\",\"\",Teacher5!K27)","v":""},{"$f":"IF(Teacher5!L27=\"\",\"\",Teacher5!L27)","v":""},{"$f":"IF(Teacher5!M27=\"\",\"\",Teacher5!M27)","v":""},null,null,{"$f":"IF(Teacher6!B27=\"\",\"\",Teacher6!B27)","v":""},{"$f":"IF(Teacher6!C27=\"\",\"\",Teacher6!C27)","v":""},{"$f":"IF(Teacher6!D27=\"\",\"\",Teacher6!D27)","v":""},{"$f":"IF(Teacher6!E27=\"\",\"\",Teacher6!E27)","v":""},{"$f":"IF(Teacher6!F27=\"\",\"\",Teacher6!F27)","v":""},{"$f":"IF(Teacher6!G27=\"\",\"\",Teacher6!G27)","v":""},{"$f":"IF(Teacher6!H27=\"\",\"\",Teacher6!H27)","v":""},{"$f":"IF(Teacher6!I27=\"\",\"\",Teacher6!I27)","v":""},{"$f":"IF(Teacher6!J27=\"\",\"\",Teacher6!J27)","v":""},{"$f":"IF(Teacher6!K27=\"\",\"\",Teacher6!K27)","v":""},{"$f":"IF(Teacher6!L27=\"\",\"\",Teacher6!L27)","v":""},{"$f":"IF(Teacher6!M27=\"\",\"\",Teacher6!M27)","v":""}]

{"sheet":"ข้อมูลการใช้สถานที่","index":21,"n_rows":25,"n_cols":13,"rows_kept":25,"cut":false,"hidden":false,"merged":[[9,0,11,0],[0,0,0,12],[1,0,1,12],[3,0,4,0],[3,1,3,12],[6,0,8,0],[2,0,2,12],[12,0,14,0],[15,0,17,0],[18,0,20,0],[21,0,23,0],[24,0,26,0]]}
[{"$f":"\"โรงเรียน\" & ตั้งค่า!C12 & \" \" & ตั้งค่า!C14","v":"โรงเรียนบ้านน้ำสอด สำนักงานเขตพื้นที่การศึกษาประถมศึกษาน่าน เขต 2"}]
["ตารางการใช้สถานที่ของ ห้องประถมศึกษาปีที่ 1/1  ภาคเรียนที่ 1 ปีการศึกษา 2559"]
[]
["วัน",{"$f":"IF(ตั้งค่า!C15=\"ชั่วโมง\",\"ชั่วโมงที่\",\"คาบที่\")","v":"ชั่วโมงที่"}]
[null,1,{"$f":"B5+1","v":2},{"$f":"C5+1","v":3},4,5,6,7,8,9,10,11,12]
["เวลา",{"$f":"ตารางเวลา!$B$2 & \" - \" & ตารางเวลา!$C$2","v":"8.00 - 8.30"},{"$f":"ตารางเวลา!$B$3 & \" - \" & ตารางเวลา!$C$3","v":"8.31 - 9.30"},{"$f":"ตารางเวลา!$B$4 & \" - \" & ตารางเวลา!$C$4","v":"9.31 - 10.30"},{"$f":"ตารางเวลา!$B$5 & \" - \" & ตารางเวลา!$C$5","v":"10.31 - 11.30"},{"$f":"ตารางเวลา!$B$6 & \" - \" & ตารางเวลา!$C$6","v":"11.31 - 12.30"},{"$f":"ตารางเวลา!$B$7 & \" - \" & ตารางเวลา!$C$7","v":"12.31 - 13.30"},{"$f":"ตารางเวลา!$B$8 & \" - \" & ตารางเวลา!$C$8","v":"13.31 - 14.30"},{"$f":"ตารางเวลา!$B$9 & \" - \" & ตารางเวลา!$C$9","v":"14.31 - 15.30"},{"$f":"ตารางเวลา!$B$10 & \" - \" & ตารางเวลา!$C$10","v":" - "},{"$f":"ตารางเวลา!$B$11 & \" - \" & ตารางเวลา!$C$11","v":" - "},{"$f":"ตารางเวลา!$B$12 & \" - \" & ตารางเวลา!$C$12","v":" - "},{"$f":"ตารางเวลา!$B$13 & \" - \" & ตารางเวลา!$C$13","v":" - "}]
["จันทร์",null,"ค11101","ท11101","ศ11101-2",null,"ง11101-1"]
[null,null,"คณิต1","ไทย1","ดนตรี1",null,"กอท1"]
[null,null,"ป.1/1","ป.1/1","ป.1/1",null,"ป.1/1"]
["อังคาร",null,"ท11101","ค11101","ส11102",null,"ศ11101-1","ก11901","ก11906"]
[null,null,"ไทย1","คณิต1","ประวัติ1",null,"ศิลปะ1","แนะแนว1","ลดเวลาเรียน"]
[null,null,"ป.1/1","ป.1/1","ป.1/1",null,"ป.1/1","ป.1/1","ป.1/1"]
["พุธ",null,"ท11101","ส11101","ค11101",null,"พ11101-1","ก11902","ก11906"]
[null,null,"ไทย1","สังคม1","คณิต1",null,"สุขะ1","ลูกเสือ1","ลดเวลาเรียน"]
[null,null,"ป.1/1","ป.1/1","ป.1/1",null,"ป.1/1","ป.1/1","ป.1/1"]
["พฤหัสบดี",null,null,"ค11101","ท11101",null,null,"พ11101-2","ก11906"]
[null,null,null,"คณิต1","ไทย1",null,null,"พละ1","ลดเวลาเรียน"]
[null,null,null,"ป.1/1","ป.1/1",null,null,"ป.1/1","ป.1/1"]
["ศุกร์",null,"ค11101","ท11101",null,null,"ส11101","ก11903","ก11906"]
[null,null,"คณิต1","ไทย1",null,null,"สังคม1","ชุมนุม1","ลดเวลาเรียน"]
[null,null,"ป.1/1","ป.1/1",null,null,"ป.1/1","ป.1/1","ป.1/1"]
["เสาร์"]
[]
[]
["อาทิตย์"]

{"sheet":"สรุปผลจำนวนคาบสอน","index":22,"n_rows":31,"n_cols":14,"rows_kept":31,"cut":false,"hidden":false,"merged":[[4,0,5,0],[1,0,1,10],[2,0,2,10],[4,1,5,1],[4,11,4,12],[4,3,4,10],[4,2,5,2],[1,11,2,14]]}
[]
[{"$f":"\"สรุปผล\" & \"จำนวน\" & ตั้งค่า!C15 & \"สอนในแต่ละวัน\"","v":"สรุปผลจำนวนชั่วโมงสอนในแต่ละวัน"},null,null,null,null,null,null,null,null,null,null,"ประมวลผลการจัดตารางสอน"]
[{"$f":"\"โรงเรียน\" & ตั้งค่า!C12 & \" ภาคเรียนที่ \" & ตั้งค่า!C11 & \" ปีการศึกษา \" & ตั้งค่า!C10","v":"โรงเรียนบ้านน้ำสอด ภาคเรียนที่ 2 ปีการศึกษา 2559"}]
[]
["ที่","รหัส","ชื่อ - นามสกุล",{"$f":"\"จำนวน\" & ตั้งค่า!C15 & \"ที่สอนในแต่ละวัน\"","v":"จำนวนชั่วโมงที่สอนในแต่ละวัน"},null,null,null,null,null,null,null,"เลือกหน้าที่จะพิมพ์ ",null,1]
[null,null,null,"จันทร์","อังคาร","พุธ","พฤหัสบดี","ศุกร์","เสาร์","อาทิตย์","รวม"]
[1,"T001","นางสาวทัศนีย์  เจนจิจะ",4,6,6,4,5,0,0,{"$f":"IF(B7=\"\",\"\",SUM(D7:J7))","v":25}]
[2,"T002","นายปิยพล  ยศศิริพันธุ์",3,2,3,4,4,0,0,{"$f":"IF(B8=\"\",\"\",SUM(D8:J8))","v":16}]
[3,"T003","นายชัยณรงค์  ธรรมสละ",6,4,4,6,5,0,0,25]
[4,"T004","นายเกียรติชัย  วัดคำ",5,6,4,4,5,0,0,24]
[5,"T005","นายบุญธรรม  บุญลาภังค์",5,5,5,4,4,0,0,23]
[6,"T006","นายอุทัย  รัตนกันทา",5,4,6,5,5,0,0,25]
[7,"T007","นางสาวรุ่งทิวา  คำสูง",3,5,5,4,4,0,0,21]
[8,"T008","นางสาวภิญญาภรณ์  อินสองใจ",5,4,3,5,4,0,0,21]
[null,null,null,null,null,null,null,null,null,null,""]
[null,null,null,null,null,null,null,null,null,null,""]
[null,null,null,null,null,null,null,null,null,null,""]
[null,null,null,null,null,null,null,null,null,null,""]
[null,null,null,null,null,null,null,null,null,null,""]
[null,null,null,null,null,null,null,null,null,null,""]
[null,null,null,null,null,null,null,null,null,null,""]
[null,null,null,null,null,null,null,null,null,null,""]
[null,null,null,null,null,null,null,null,null,null,""]
[null,null,null,null,null,null,null,null,null,null,""]
[null,null,null,null,null,null,null,null,null,null,""]
[null,null,null,null,null,null,null,null,null,null,""]
[null,null,null,null,null,null,null,null,null,null,""]
[null,null,null,null,null,null,null,null,null,null,""]
[null,null,null,null,null,null,null,null,null,null,""]
[null,null,null,null,null,null,null,null,null,null,""]
[null,null,null,null,null,null,null,null,null,null,""]

{"sheet":"สรุปผลวิชาของครูผู้สอน","index":23,"n_rows":41,"n_cols":7,"rows_kept":41,"cut":false,"hidden":false,"merged":[[1,0,1,5],[2,0,2,5],[1,6,2,9],[40,0,40,3]]}
[]
["สรุปผลวิชาเรียน",null,null,null,null,null,"ประมวลผลวิชาเรียน"]
["ของ นายเกียรติชัย วัดคำ โรงเรียนบ้านน้ำสอด ภาคเรียนที่ 1 ปีการศึกษา 2559"]
[]
["ที่","รหัสวิชา","ชื่อวิชา","ชั้นที่สอน",{"$f":"\"จำนวน\" & ตั้งค่า!C15","v":"จำนวนชั่วโมง"},"หมายเหตุ"]
[1,"ท14101","   ภาษาไทย 4","ประถมศึกษาปีที่ 4/1",4]
[2,"ค14101","   คณิตศาสตร์ 4","ประถมศึกษาปีที่ 4/1",4]
[3,"ส14101","   สังคมศึกษา ศาสนาและวัฒนธรรม 4","ประถมศึกษาปีที่ 4/1",2]
[4,"ส14102","   ประวัติศาสตร์ 4","ประถมศึกษาปีที่ 4/1",1]
[5,"ศ14101-1","   ศิลปะ 4","ประถมศึกษาปีที่ 4/1",1]
[6,"ศ14101-2","   ดนตรี 4","ประถมศึกษาปีที่ 4/1",1]
[7,"ง14101-1","   การงานอาชีพและเทคโนโลยี 4","ประถมศึกษาปีที่ 4/1",1]
[8,"ส14234","   หน้าที่พลเมือง 4","ประถมศึกษาปีที่ 4/1",0]
[9,"ก14901","   แนะแนว 4","ประถมศึกษาปีที่ 4/1",1]
[10,"ก14902","   ลูกเสือ เนตรนารี 3","ประถมศึกษาปีที่ 4/1",1]
[11,"ก14903","   ชุมนุม","ประถมศึกษาปีที่ 4/1",1]
[12,"ก14906","   ลดเวลาเรียน เพิ่มเวลารู้","ประถมศึกษาปีที่ 4/1",5]
[13,"ศ16101-1","   ศิลปะ 6","ประถมศึกษาปีที่ 6/1",1]
[14,"ศ16101-2","   ดนตรี 6","ประถมศึกษาปีที่ 6/1",1]
[]
[]
[]
[]
[]
[]
[]
[]
[]
[]
[]
[]
[]
[]
[]
[]
[]
[]
[]
[]
[]
["รวม",null,null,null,{"$f":"SUM(E6:E40)","v":24},"ชั่วโมง"]

{"sheet":"รายวิชาที่ทำการสอน","index":24,"n_rows":23,"n_cols":7,"rows_kept":23,"cut":false,"hidden":false,"merged":[[1,0,1,5],[1,6,2,9],[2,0,2,5]]}
[]
["สรุปผลวิชาเรียน",null,null,null,null,null,"ประมวลผลวิชาเรียน"]
["ของ ประถมศึกษาปีที่ 1/1 โรงเรียนบ้านน้ำสอด ภาคเรียนที่ 1 ปีการศึกษา 2559"]
[]
["ที่","รหัสวิชา","ชื่อวิชา","ประเภท",{"$f":"\"จำนวน\" & ตั้งค่า!C26","v":"จำนวน"},"หมายเหตุ"]
[1,"ท11101","   ภาษาไทย 1","พื้นฐาน",5]
[2,"ค11101","   คณิตศาสตร์ 1","พื้นฐาน",5]
[3,"ส11101","   สังคมศึกษา ศาสนาและวัฒนธรรม 1","พื้นฐาน",2]
[4,"ส11102","   ประวัติศาสตร์ 1","พื้นฐาน",1]
[5,"พ11101-1","   สุขศึกษา 1","พื้นฐาน",1]
[6,"พ11101-2","   พลศึกษา 1","พื้นฐาน",1]
[7,"ศ11101-1","   ศิลปะ 1","พื้นฐาน",1]
[8,"ศ11101-2","   ดนตรี 1","พื้นฐาน",1]
[9,"ง11101-1","   การงานอาชีพและเทคโนโลยี  1","พื้นฐาน",1]
[10,"ก11901","   แนะแนว 1","กิจกรรม",1]
[11,"ก11902","   ลูกเสือ เนตรนารี 1","กิจกรรม",1]
[12,"ก11903","   ชุมนุม","กิจกรรม",1]
[13,"ก11906","   ลดเวลาเรียน เพิ่มเวลารู้","กิจกรรม",4,"ลดเวลาฯ"]
[14,"ก11905","   ลดเวลาเรียนฯ(เรียนรู้ก้าวไกลกับ ICT)","กิจกรรม",1,"ลดเวลาฯ"]
[15,"อ11101","   ภาษาอังกฤษ 1","พื้นฐาน",1]
[16,"อ11201","   ภาษาอังกฤษเพิ่มเติม ศัพท์แสนสนุก 1","เพิ่มเติม",1]
[17,"ว11101","   วิทยาศาสตร์ 1","พื้นฐาน",2]
[18,"ส11231","   หน้าที่พลเมือง 1","เพิ่มเติม",0,"บูรณาการ"]